{"text_format":"1","workbook":"xlsx","n_sheets":4,"sheets":["TABELA","jogo","classificação","MAIS PLANILHAS DE EXCEL"],"not_rendered":{"charts":0,"images":1,"macros":1,"external_links":0,"defined_names":23,"comments":0,"pivot_tables":0},"unopened":[],"bounds":{"document_bytes":16777216,"sheet_cells":100000,"rows_first":2000,"rows_last":500,"rows_between":2000,"halvings":0,"cell_chars":16384,"cell_head_chars":4096},"cells_cut":0,"cells_raw":0,"read":"whole","date_system":"1900"}

{"sheet":"TABELA","index":0,"n_rows":597,"n_cols":34,"rows_kept":597,"cut":false,"hidden":false,"merged":[[56,11,56,16],[57,11,57,16],[58,11,58,16],[51,11,51,16],[52,11,52,16],[53,11,53,16],[54,11,54,16],[55,11,55,16],[3,30,3,31],[45,11,46,16],[3,32,3,33],[3,28,3,29],[3,22,3,23],[3,24,3,25],[47,12,48,15],[49,11,49,16],[39,11,39,17],[0,5,1,5],[3,26,3,27],[0,11,0,19],[1,11,1,19]]}
[null,"Brasileirão 2017",null,null,null,2017,null,null,null,null,null,{"$f":"L2","v":"www.tudoexcel.com.br"}]
[null,"Pontos corridos",null,null,null,null,null,null,null,null,null,"www.tudoexcel.com.br"]
["Os Jogos poderão sofrer alterações por decisão da CBF"]
["20 times se enfrentam em 2 turnos - os últimos 4 caem para a segundona",null,null,null,null,null,null,null,null,"C L A S S I F I C A Ç Ã O",null,null,null,null,null,null,null,null,null,null,null,null,"pontos",null,"Jogos",null,"gols",null,"vitoria",null,"empate",null,"derrota"]
["Data","Joga em casa",null,null,null,"Visitante","Local",null,"P","Times","PG","J","V","E","D","GP","GC","SG",null,"Pp","AP%",null,"D.C","VT","D.C","VT","D.C","VT","D.C","VT","D.C","VT","D.C","VT"]
["1 ª Rodada",null,null,null,null,null,null,null,1,"Chapecoense",{"$f":"IF($L$1=K6xL6,SUMIF($B$6:$B$597,J6,$W$6:$W$597)+SUMIF($F$6:$F$597,J6,$X$6:$X$597),\"Erro\")","v":7},{"$f":"SUMIF($B$6:$B$597,J6,$Y$6:$Y$597)+SUMIF($F$6:$F$597,J6,$Z$6:$Z$597)","v":3},{"$f":"SUMIF($B$6:$B$597,J6,$AC$6:$AC$597)+SUMIF($F$6:$F$597,J6,$AD$6:$AD$597)","v":2},{"$f":"SUMIF($B$6:$B$597,J6,$AE$6:$AE$597)+SUMIF($F$6:$F$597,J6,$AF$6:$AF$597)","v":1},{"$f":"SUMIF($B$6:$B$597,J6,$AG$6:$AG$597)+SUMIF($F$6:$F$597,J6,$AH$6:$AH$597)","v":0},{"$f":"SUMIF($B$6:$B$597,J6,$AA$6:$AA$597)+SUMIF($F$6:$F$597,J6,$AB$6:$AB$597)","v":4},{"$f":"SUMIF($B$6:$B$597,J6,$AB$6:$AB$597)+SUMIF($F$6:$F$597,J6,$AA$6:$AA$597)","v":1},{"$f":"IF($L$1=K6xL6,SUM(P6-Q6),\"erro\")","v":3},null,{"$f":"(L6*3)-K6","v":2},{"$f":"IF(L6=0,\"\",(K6/(3*L6)))","v":0.77777777777777779},null,{"$f":"IF(C6&E6=\"\",\"\",IF(C6=E6,1,IF(C6>E6,3,IF(C6<E6,0))))","v":""},{"$f":"IF(C6&E6=\"\",\"\",IF(E6=C6,1,IF(C6<E6,3,IF(C6>E6,0))))","v":""},{"$f":"IF(C6&E6=\"\",\"\",IF(C6&E6<>\"\",1))","v":""},{"$f":"IF(C6&E6=\"\",\"\",IF(C6&E6<>\"\",1))","v":""},{"$f":"IF(C6=\"\",\"\",C6)","v":""},{"$f":"IF(E6=\"\",\"\",E6)","v":""},{"$f":"IF(W6=3,1,0)","v":0},{"$f":"IF(X6=3,1,0)","v":0},{"$f":"IF(W6=1,1,0)","v":0},{"$f":"IF(X6=1,1,0)","v":0},{"$f":"IF(W6=0,1,0)","v":0},{"$f":"IF(X6=0,1,0)","v":0}]
["Data/Horário",null,null,null,null,null,"Local",null,2,"Cruzeiro",7,3,2,1,0,3,1,2,null,2,{"$f":"IF(L7=0,\"\",(K7/(3*L7)))","v":0.77777777777777779},null,"","","","","","",{"$f":"IF(W7=3,1,0)","v":0},{"$f":"IF(X7=3,1,0)","v":0},{"$f":"IF(W7=1,1,0)","v":0},{"$f":"IF(X7=1,1,0)","v":0},{"$f":"IF(W7=0,1,0)","v":0},{"$f":"IF(X7=0,1,0)","v":0}]
[{"$f":"jogo!A8","v":"15.05. 20:00"},{"$f":"jogo!B8","v":"Flamengo"},1,"x",1,{"$f":"jogo!D8","v":"Atlético-MG"},{"$f":"jogo!E8","v":"Maracanã"},null,3,"Corinthians",7,3,2,1,0,3,1,2,null,2,0.77777777777777779,null,1,1,1,1,1,1,0,0,1,1,0,0]
[{"$f":"jogo!A9","v":"14.05. 19:00"},{"$f":"jogo!B9","v":"Corinthians"},1,"x",1,{"$f":"jogo!D9","v":"Chapecoense"},{"$f":"jogo!E9","v":"Arena Corinthians"},null,4,"Grêmio",6,3,2,0,1,7,4,3,null,3,0.66666666666666663,null,1,1,1,1,1,1,0,0,1,1,0,0]
[{"$f":"jogo!A10","v":"14.05. 16:00"},{"$f":"jogo!B10","v":"Fluminense"},3,"x",2,{"$f":"jogo!D10","v":"Santos"},{"$f":"jogo!E10","v":"Maracanã"},null,5,"Coritiba",6,3,2,0,1,5,2,3,null,3,0.66666666666666663,null,3,0,1,1,3,2,1,0,0,0,0,1]
[{"$f":"jogo!A11","v":"14.05. 16:00"},{"$f":"jogo!B11","v":"Bahia"},6,"x",2,{"$f":"jogo!D11","v":"Atlético-PR"},{"$f":"jogo!E11","v":"Arena Fonte Nova"},null,6,"São Paulo",6,3,2,0,1,4,1,3,null,3,0.66666666666666663,null,3,0,1,1,6,2,1,0,0,0,0,1]
[{"$f":"jogo!A12","v":"14.05. 16:00"},{"$f":"jogo!B12","v":"Avaí"},0,"x",0,{"$f":"jogo!D12","v":"Vitória"},{"$f":"jogo!E12","v":"Ressacada"},null,7,"Fluminense",6,3,2,0,1,7,6,1,null,3,0.66666666666666663,null,1,1,1,1,0,0,0,0,1,1,0,0]
[{"$f":"jogo!A13","v":"14.05. 16:00"},{"$f":"jogo!B13","v":"Cruzeiro"},1,"x",0,{"$f":"jogo!D13","v":"São Paulo"},{"$f":"jogo!E13","v":"Mineirão"},null,8,"Botafogo",6,3,2,0,1,3,2,1,null,3,0.66666666666666663,null,3,0,1,1,1,0,1,0,0,0,0,1]
[{"$f":"jogo!A14","v":"14.05. 16:00"},{"$f":"jogo!B14","v":"Ponte Preta"},4,"x",0,{"$f":"jogo!D14","v":"Sport Recife"},{"$f":"jogo!E14","v":"Moisés Lucarelli"},null,9,"Vasco",6,3,2,0,1,5,7,-2,null,3,0.66666666666666663,null,3,0,1,1,4,0,1,0,0,0,0,1]
[{"$f":"jogo!A15","v":"14.05. 11:00"},{"$f":"jogo!B15","v":"Palmeiras"},4,"x",0,{"$f":"jogo!D15","v":"Vasco"},{"$f":"jogo!E15","v":"Allianz Parque"},null,10,"Flamengo",5,3,1,2,0,5,2,3,null,4,0.55555555555555558,null,3,0,1,1,4,0,1,0,0,0,0,1]
[{"$f":"jogo!A16","v":"13.05. 19:00"},{"$f":"jogo!B16","v":"Grêmio"},2,"x",0,{"$f":"jogo!D16","v":"Botafogo"},{"$f":"jogo!E16","v":"Arena do Grêmio"},null,11,"Ponte Preta",4,3,1,1,1,6,4,2,null,5,{"$f":"IF(L16=0,\"\",(K16/(3*L16)))","v":0.44444444444444442},null,3,0,1,1,2,0,1,0,0,0,0,1]
[{"$f":"jogo!A17","v":"13.05. 16:00"},{"$f":"jogo!B17","v":"Coritiba"},4,"x",1,{"$f":"jogo!D17","v":"Atlético-GO"},{"$f":"jogo!E17","v":"Couto Pereira"},null,12,"Sport Recife",4,3,1,1,1,5,8,-3,null,5,0.44444444444444442,null,3,0,1,1,4,1,1,0,0,0,0,1]
["2 ª Rodada",null,null,null,null,null,null,null,13,"Bahia",3,3,1,0,2,7,5,2,null,6,0.33333333333333331,null,"","","","","","",0,0,0,0,0,0]
["Data/Horário",null,null,null,null,null,"Local",null,14,"Palmeiras",3,3,1,0,2,4,3,1,null,6,0.33333333333333331,null,"","","","","","",0,0,0,0,0,0]
[{"$f":"jogo!A20","v":"22.05. 20:00"},{"$f":"jogo!B20","v":"Santos"},1,"x",0,{"$f":"jogo!D20","v":"Coritiba"},{"$f":"jogo!E20","v":"Vila Belmiro"},null,15,"Santos",3,3,1,0,2,3,4,-1,null,6,0.33333333333333331,null,3,0,1,1,1,0,1,0,0,0,0,1]
[{"$f":"jogo!A21","v":"21.05. 19:00"},{"$f":"jogo!B21","v":"Chapecoense"},1,"x",0,{"$f":"jogo!D21","v":"Palmeiras"},{"$f":"jogo!E21","v":"Arena Condá"},null,16,"Atlético-MG",2,3,0,2,1,4,5,-1,null,7,0.22222222222222221,null,3,0,1,1,1,0,1,0,0,0,0,1]
[{"$f":"jogo!A22","v":"21.05. 18:00"},{"$f":"jogo!B22","v":"Atlético-GO"},0,"x",3,{"$f":"jogo!D22","v":"Flamengo"},{"$f":"jogo!E22","v":"Serra Dourada"},null,17,"Vitória",1,3,0,1,2,0,2,-2,null,8,{"$f":"IF(L22=0,\"\",(K22/(3*L22)))","v":0.1111111111111111},null,0,3,1,1,0,3,0,1,0,0,1,0]
[{"$f":"jogo!A23","v":"21.05. 16:00"},{"$f":"jogo!B23","v":"Vasco"},2,"x",1,{"$f":"jogo!D23","v":"Bahia"},{"$f":"jogo!E23","v":"São Januário"},null,18,"Avaí",1,3,0,1,2,0,4,-4,null,8,0.1111111111111111,null,3,0,1,1,2,1,1,0,0,0,0,1]
[{"$f":"jogo!A24","v":"21.05. 16:00"},{"$f":"jogo!B24","v":"Vitória"},0,"x",1,{"$f":"jogo!D24","v":"Corinthians"},{"$f":"jogo!E24","v":"Barradão"},null,19,"Atlético-PR",1,3,0,1,2,3,9,-6,null,8,0.1111111111111111,null,0,3,1,1,0,1,0,1,0,0,1,0]
[{"$f":"jogo!A25","v":"21.05. 16:00"},{"$f":"jogo!B25","v":"Atlético-PR"},0,"x",2,{"$f":"jogo!D25","v":"Grêmio"},{"$f":"jogo!E25","v":"Arena da Baixada"},null,20,"Atlético-GO",0,3,0,0,3,1,8,-7,null,9,0,null,0,3,1,1,0,2,0,1,0,0,1,0]
[{"$f":"jogo!A26","v":"21.05. 11:00"},{"$f":"jogo!B26","v":"Botafogo"},2,"x",0,{"$f":"jogo!D26","v":"Ponte Preta"},{"$f":"jogo!E26","v":"Nilton Santos"},null,null,null,null,null,null,null,null,null,null,null,null,null,null,null,3,0,1,1,2,0,1,0,0,0,0,1]
[{"$f":"jogo!A27","v":"20.05. 19:00"},{"$f":"jogo!B27","v":"Atlético-MG"},1,"x",2,{"$f":"jogo!D27","v":"Fluminense"},{"$f":"jogo!E27","v":"Independência"},null,null,"Não funciona no OpenOffice devido a Macro",null,null,null,null,null,null,null,null,null,null,null,null,0,3,1,1,1,2,0,1,0,0,1,0]
[{"$f":"jogo!A28","v":"20.05. 19:00"},{"$f":"jogo!B28","v":"Sport Recife"},1,"x",1,{"$f":"jogo!D28","v":"Cruzeiro"},{"$f":"jogo!E28","v":"Ilha do Retiro"},null,null,null,null,null,null,null,null,null,null,null,null,null,"",null,1,1,1,1,1,1,0,0,1,1,0,0]
[{"$f":"jogo!A29","v":"20.05. 16:00"},{"$f":"jogo!B29","v":"São Paulo"},2,"x",0,{"$f":"jogo!D29","v":"Avaí"},{"$f":"jogo!E29","v":"Morumbi"},null,null,"OBS","Se a Macro Atualizar não funcionar",null,null,null,null,null,null,null,null,null,"",null,3,0,1,1,2,0,1,0,0,0,0,1]
["3 ª Rodada",null,null,null,null,null,null,null,null,null,"Habilite-a para poder atualizar a tabela",null,null,null,null,null,null,null,null,null,null,null,"","","","","","",0,0,0,0,0,0]
["Data/Horário",null,null,null,null,null,"Local",null,null,null,"Excel 2007 ",null,null,null,null,null,null,null,null,null,null,null,"","","","","","",0,0,0,0,0,0]
[{"$f":"jogo!A32","v":"29.05. 20:00"},{"$f":"jogo!B32","v":"São Paulo"},2,"x",0,{"$f":"jogo!D32","v":"Palmeiras"},{"$f":"jogo!E32","v":"Morumbi"},null,null,null,"Excel XP",null,null,null,null,null,null,null,null,null,null,null,3,0,1,1,2,0,1,0,0,0,0,1]
[{"$f":"jogo!A33","v":"28.05. 19:00"},{"$f":"jogo!B33","v":"Vasco"},3,"x",2,{"$f":"jogo!D33","v":"Fluminense"},{"$f":"jogo!E33","v":"São Januário"},null,null,null,"Excel 97/2000/2003",null,null,null,null,null,null,null,null,null,null,null,3,0,1,1,3,2,1,0,0,0,0,1]
[{"$f":"jogo!A34","v":"28.05. 18:00"},{"$f":"jogo!B34","v":"Vitória"},0,"x",1,{"$f":"jogo!D34","v":"Coritiba"},{"$f":"jogo!E34","v":"Barradão"},null,null,null,"Você pode alterar datas e horários",null,null,null,null,null,null,null,null,null,null,null,0,3,1,1,0,1,0,1,0,0,1,0]
[{"$f":"jogo!A35","v":"28.05. 16:00"},{"$f":"jogo!B35","v":"Atlético-MG"},2,"x",2,{"$f":"jogo!D35","v":"Ponte Preta"},{"$f":"jogo!E35","v":"Independência"},null,null,null,"de acordo com as mudanças da CBF",null,null,null,null,null,null,null,null,null,null,null,1,1,1,1,2,2,0,0,1,1,0,0]
[{"$f":"jogo!A36","v":"28.05. 16:00"},{"$f":"jogo!B36","v":"Atlético-PR"},1,"x",1,{"$f":"jogo!D36","v":"Flamengo"},{"$f":"jogo!E36","v":"Arena da Baixada"},null,null,null,"Não nos responsabilizamos pelas mudancas",null,null,null,null,null,null,null,null,null,null,null,1,1,1,1,1,1,0,0,1,1,0,0]
[{"$f":"jogo!A37","v":"28.05. 16:00"},{"$f":"jogo!B37","v":"Atlético-GO"},0,"x",1,{"$f":"jogo!D37","v":"Corinthians"},{"$f":"jogo!E37","v":"Serra Dourada"},null,null,null,null,null,null,null,null,null,null,null,null,null,null,null,0,3,1,1,0,1,0,1,0,0,1,0]
[{"$f":"jogo!A38","v":"28.05. 11:00"},{"$f":"jogo!B38","v":"Santos"},0,"x",1,{"$f":"jogo!D38","v":"Cruzeiro"},{"$f":"jogo!E38","v":"Vila Belmiro"},null,null,null,null,null,null,null,null,null,null,null,null,null,null,null,0,3,1,1,0,1,0,1,0,0,1,0]
[{"$f":"jogo!A39","v":"27.05. 21:00"},{"$f":"jogo!B39","v":"Botafogo"},1,"x",0,{"$f":"jogo!D39","v":"Bahia"},{"$f":"jogo!E39","v":"Nilton Santos"},null,null,null,null,null,null,null,null,null,null,null,null,null,null,null,3,0,1,1,1,0,1,0,0,0,0,1]
[{"$f":"jogo!A40","v":"27.05. 19:00"},{"$f":"jogo!B40","v":"Sport Recife"},4,"x",3,{"$f":"jogo!D40","v":"Grêmio"},{"$f":"jogo!E40","v":"Ilha do Retiro"},null,null,null,null,"Clique Aqui e Veja Mais Planilhas",null,null,null,null,null,null,null,null,null,null,3,0,1,1,4,3,1,0,0,0,0,1]
[{"$f":"jogo!A41","v":"27.05. 16:00"},{"$f":"jogo!B41","v":"Chapecoense"},2,"x",0,{"$f":"jogo!D41","v":"Avaí"},{"$f":"jogo!E41","v":"Arena Condá"},null,null,null,null,null,null,null,null,null,null,null,null,null,null,null,3,0,1,1,2,0,1,0,0,0,0,1]
["4 ª Rodada",null,null,null,null,null,null,null,null,null,null,null,null,null,null,null,null,null,null,null,null,null,"","","","","","",0,0,0,0,0,0]
["Data/Horário",null,null,null,null,null,"Local",null,null,null,null,null,null,null,null,null,null,null,null,null,null,null,"","","","","","",0,0,0,0,0,0]
[{"$f":"jogo!A44","v":"03.06. 16:00"},{"$f":"jogo!B44","v":"Coritiba"},null,"x",null,{"$f":"jogo!D44","v":"Atlético-PR"},{"$f":"jogo!E44","v":"Couto Pereira"},null,null,null,null,null,null,null,null,null,null,null,null,null,null,null,"","","","","","",0,0,0,0,0,0]
[{"$f":"jogo!A45","v":"03.06. 18:00"},{"$f":"jogo!B45","v":"Fluminense"},null,"x",null,{"$f":"jogo!D45","v":"Vitória"},{"$f":"jogo!E45","v":"Maracanã"},null,null,null,null,null,null,null,null,null,null,null,null,null,null,null,"","","","","","",0,0,0,0,0,0]
[{"$f":"jogo!A46","v":"03.06. 19:00"},{"$f":"jogo!B46","v":"Corinthians"},null,"x",null,{"$f":"jogo!D46","v":"Santos"},{"$f":"jogo!E46","v":"Arena Corinthians"},null,null,null,null,"Super Planilhas de Excel",null,null,null,null,null,null,null,null,null,null,"","","","","","",0,0,0,0,0,0]
[{"$f":"jogo!A47","v":"04.06. 11:00"},{"$f":"jogo!B47","v":"Avaí"},null,"x",null,{"$f":"jogo!D47","v":"Sport Recife"},{"$f":"jogo!E47","v":"Ressacada"},null,null,null,null,null,null,null,null,null,null,null,null,null,null,null,"","","","","","",0,0,0,0,0,0]
[{"$f":"jogo!A48","v":"04.06. 11:00"},{"$f":"jogo!B48","v":"Flamengo"},null,"x",null,{"$f":"jogo!D48","v":"Botafogo"},{"$f":"jogo!E48","v":"Maracanã"},null,null,null,null,null,"Clique Aqui",null,null,null,null,null,null,null,null,null,"","","","","","",0,0,0,0,0,0]
[{"$f":"jogo!A49","v":"04.06. 16:00"},{"$f":"jogo!B49","v":"Grêmio"},null,"x",null,{"$f":"jogo!D49","v":"Vasco"},{"$f":"jogo!E49","v":"Arena do Grêmio"},null,null,null,null,null,null,null,null,null,null,null,null,null,null,null,"","","","","","",0,0,0,0,0,0]
[{"$f":"jogo!A50","v":"04.06. 16:00"},{"$f":"jogo!B50","v":"Palmeiras"},null,"x",null,{"$f":"jogo!D50","v":"Atlético-MG"},{"$f":"jogo!E50","v":"Allianz Parque"},null,null,null,null,"e acesse diversas planilhas",null,null,null,null,null,null,null,null,null,null,"","","","","","",0,0,0,0,0,0]
[{"$f":"jogo!A51","v":"04.06. 16:00"},{"$f":"jogo!B51","v":"Ponte Preta"},null,"x",null,{"$f":"jogo!D51","v":"São Paulo"},{"$f":"jogo!E51","v":"Moisés Lucarelli"},null,null,null,null,null,null,null,null,null,null,null,null,null,null,null,"","","","","","",0,0,0,0,0,0]
[{"$f":"jogo!A52","v":"04.06. 19:00"},{"$f":"jogo!B52","v":"Cruzeiro"},null,"x",null,{"$f":"jogo!D52","v":"Chapecoense"},{"$f":"jogo!E52","v":"Mineirão"},null,null,null,null,"planilha de controle de estoque",null,null,null,null,null,null,null,null,null,null,"","","","","","",0,0,0,0,0,0]
[{"$f":"jogo!A53","v":"05.06. 20:00"},{"$f":"jogo!B53","v":"Bahia"},null,"x",null,{"$f":"jogo!D53","v":"Atlético-GO"},{"$f":"jogo!E53","v":"Arena Fonte Nova"},null,null,null,null,"planilha de controle de gastos",null,null,null,null,null,null,null,null,null,null,"","","","","","",0,0,0,0,0,0]
["5 ª Rodada",null,null,null,null,null,null,null,null,null,null,"planilha de fluxo de caixa",null,null,null,null,null,null,null,null,null,null,"","","","","","",0,0,0,0,0,0]
["Data/Horário",null,null,null,null,null,"Local",null,null,null,null,"planilha de cotação de preços",null,null,null,null,null,null,null,null,null,null,"","","","","","",0,0,0,0,0,0]
[{"$f":"jogo!A56","v":"06.06. 20:00"},{"$f":"jogo!B56","v":"Fluminense"},null,"x",null,{"$f":"jogo!D56","v":"Atlético-PR"},{"$f":"jogo!E56","v":"Maracanã"},null,null,null,null,"custo para construção e reformas",null,null,null,null,null,null,null,null,null,null,"","","","","","",0,0,0,0,0,0]
[{"$f":"jogo!A57","v":"07.06. 19:30"},{"$f":"jogo!B57","v":"Atlético-MG"},null,"x",null,{"$f":"jogo!D57","v":"Avaí"},{"$f":"jogo!E57","v":"Independência"},null,null,null,null,null,null,null,null,null,null,null,null,null,null,null,"","","","","","",0,0,0,0,0,0]
[{"$f":"jogo!A58","v":"07.06. 19:30"},{"$f":"jogo!B58","v":"Coritiba"},null,"x",null,{"$f":"jogo!D58","v":"Palmeiras"},{"$f":"jogo!E58","v":"Couto Pereira"},null,null,null,null,"E MUITAS OUTRAS",null,null,null,null,null,null,null,null,null,null,"","","","","","",0,0,0,0,0,0]
[{"$f":"jogo!A59","v":"07.06. 21:00"},{"$f":"jogo!B59","v":"Santos"},null,"x",null,{"$f":"jogo!D59","v":"Botafogo"},{"$f":"jogo!E59","v":"Vila Belmiro"},null,null,null,null,"VOCÊ ENCONTRA AQUI",null,null,null,null,null,null,null,null,null,null,"","","","","","",0,0,0,0,0,0]
[{"$f":"jogo!A60","v":"07.06. 21:45"},{"$f":"jogo!B60","v":"Chapecoense"},null,"x",null,{"$f":"jogo!D60","v":"Grêmio"},{"$f":"jogo!E60","v":"Arena Condá"},null,null,null,null,null,null,null,null,null,null,null,null,null,null,null,"","","","","","",0,0,0,0,0,0]
[{"$f":"jogo!A61","v":"07.06. 21:45"},{"$f":"jogo!B61","v":"Sport Recife"},null,"x",null,{"$f":"jogo!D61","v":"Flamengo"},{"$f":"jogo!E61","v":"Ilha do Retiro"},null,null,null,null,null,null,null,null,null,null,null,null,null,null,null,"","","","","","",0,0,0,0,0,0]
[{"$f":"jogo!A62","v":"07.06. 21:45"},{"$f":"jogo!B62","v":"Vasco"},null,"x",null,{"$f":"jogo!D62","v":"Corinthians"},{"$f":"jogo!E62","v":"São Januário"},null,null,null,null,null,null,null,null,null,null,null,null,null,null,null,"","","","","","",0,0,0,0,0,0]
[{"$f":"jogo!A63","v":"08.06. 19:30"},{"$f":"jogo!B63","v":"Atlético-GO"},null,"x",null,{"$f":"jogo!D63","v":"Ponte Preta"},{"$f":"jogo!E63","v":"Serra Dourada"},null,null,null,null,null,null,null,null,null,null,null,null,null,null,null,"","","","","","",0,0,0,0,0,0]
[{"$f":"jogo!A64","v":"08.06. 19:30"},{"$f":"jogo!B64","v":"São Paulo"},null,"x",null,{"$f":"jogo!D64","v":"Vitória"},{"$f":"jogo!E64","v":"Morumbi"},null,null,null,null,null,null,null,null,null,null,null,null,null,null,null,"","","","","","",0,0,0,0,0,0]
[{"$f":"jogo!A65","v":"08.06. 21:00"},{"$f":"jogo!B65","v":"Bahia"},null,"x",null,{"$f":"jogo!D65","v":"Cruzeiro"},{"$f":"jogo!E65","v":"Arena Fonte Nova"},null,null,null,null,null,null,null,null,null,null,null,null,null,null,null,"","","","","","",0,0,0,0,0,0]
["6 ª Rodada",null,null,null,null,null,null,null,null,null,null,null,null,null,null,null,null,null,null,null,null,null,"","","","","","",0,0,0,0,0,0]
["Data/Horário",null,null,null,null,null,"Local",null,null,null,null,null,null,null,null,null,null,null,null,null,null,null,"","","","","","",0,0,0,0,0,0]
[{"$f":"jogo!A68","v":"10.06. 16:00"},{"$f":"jogo!B68","v":"Palmeiras"},null,"x",null,{"$f":"jogo!D68","v":"Fluminense"},{"$f":"jogo!E68","v":"Allianz Parque"},null,null,null,null,null,null,null,null,null,null,null,null,null,null,null,"","","","","","",0,0,0,0,0,0]
[{"$f":"jogo!A69","v":"10.06. 19:00"},{"$f":"jogo!B69","v":"Vasco"},null,"x",null,{"$f":"jogo!D69","v":"Sport Recife"},{"$f":"jogo!E69","v":"São Januário"},null,null,null,null,null,null,null,null,null,null,null,null,null,null,null,"","","","","","",0,0,0,0,0,0]
[{"$f":"jogo!A70","v":"11.06. 11:00"},{"$f":"jogo!B70","v":"Botafogo"},null,"x",null,{"$f":"jogo!D70","v":"Coritiba"},{"$f":"jogo!E70","v":"Nilton Santos"},null,null,null,null,null,null,null,null,null,null,null,null,null,null,null,{"$f":"IF(C70&E70=\"\",\"\",IF(C70=E70,1,IF(C70>E70,3,IF(C70<E70,0))))","v":""},{"$f":"IF(C70&E70=\"\",\"\",IF(E70=C70,1,IF(C70<E70,3,IF(C70>E70,0))))","v":""},{"$f":"IF(C70&E70=\"\",\"\",IF(C70&E70<>\"\",1))","v":""},{"$f":"IF(C70&E70=\"\",\"\",IF(C70&E70<>\"\",1))","v":""},{"$f":"IF(C70=\"\",\"\",C70)","v":""},{"$f":"IF(E70=\"\",\"\",E70)","v":""},0,0,0,0,0,0]
[{"$f":"jogo!A71","v":"11.06. 16:00"},{"$f":"jogo!B71","v":"Avaí"},null,"x",null,{"$f":"jogo!D71","v":"Flamengo"},{"$f":"jogo!E71","v":"Ressacada"},null,null,null,null,null,null,null,null,null,null,null,null,null,null,null,"","","","","","",{"$f":"IF(W71=3,1,0)","v":0},{"$f":"IF(X71=3,1,0)","v":0},{"$f":"IF(W71=1,1,0)","v":0},{"$f":"IF(X71=1,1,0)","v":0},{"$f":"IF(W71=0,1,0)","v":0},{"$f":"IF(X71=0,1,0)","v":0}]
[{"$f":"jogo!A72","v":"11.06. 16:00"},{"$f":"jogo!B72","v":"Corinthians"},null,"x",null,{"$f":"jogo!D72","v":"São Paulo"},{"$f":"jogo!E72","v":"Arena Corinthians"},null,null,null,null,null,null,null,null,null,null,null,null,null,null,null,"","","","","","",0,0,0,0,0,0]
[{"$f":"jogo!A73","v":"11.06. 16:00"},{"$f":"jogo!B73","v":"Ponte Preta"},null,"x",null,{"$f":"jogo!D73","v":"Chapecoense"},{"$f":"jogo!E73","v":"Moisés Lucarelli"},null,null,null,null,null,null,null,null,null,null,null,null,null,null,null,"","","","","","",0,0,0,0,0,0]
[{"$f":"jogo!A74","v":"11.06. 16:00"},{"$f":"jogo!B74","v":"Vitória"},null,"x",null,{"$f":"jogo!D74","v":"Atlético-MG"},{"$f":"jogo!E74","v":"Barradão"},null,null,null,null,null,null,null,null,null,null,null,null,null,null,null,"","","","","","",0,0,0,0,0,0]
[{"$f":"jogo!A75","v":"11.06. 18:30"},{"$f":"jogo!B75","v":"Cruzeiro"},null,"x",null,{"$f":"jogo!D75","v":"Atlético-GO"},{"$f":"jogo!E75","v":"Mineirão"},null,null,null,null,null,null,null,null,null,null,null,null,null,null,null,"","","","","","",0,0,0,0,0,0]
[{"$f":"jogo!A76","v":"11.06. 19:00"},{"$f":"jogo!B76","v":"Atlético-PR"},null,"x",null,{"$f":"jogo!D76","v":"Santos"},{"$f":"jogo!E76","v":"Arena da Baixada"},null,null,null,null,null,null,null,null,null,null,null,null,null,null,null,"","","","","","",0,0,0,0,0,0]
[{"$f":"jogo!A77","v":"12.06. 20:00"},{"$f":"jogo!B77","v":"Grêmio"},null,"x",null,{"$f":"jogo!D77","v":"Bahia"},{"$f":"jogo!E77","v":"Arena do Grêmio"},null,null,null,null,null,null,null,null,null,null,null,null,null,null,null,"","","","","","",0,0,0,0,0,0]
["7 ª Rodada",null,null,null,null,null,null,null,null,null,null,null,null,null,null,null,null,null,null,null,null,null,"","","","","","",0,0,0,0,0,0]
["Data/Horário",null,null,null,null,null,"Local",null,null,null,null,null,null,null,null,null,null,null,null,null,null,null,"","","","","","",0,0,0,0,0,0]
[{"$f":"jogo!A80","v":"14.06. 19:30"},{"$f":"jogo!B80","v":"Atlético-GO"},null,"x",null,{"$f":"jogo!D80","v":"Avaí"},{"$f":"jogo!E80","v":"Serra Dourada"},null,null,null,null,null,null,null,null,null,null,null,null,null,null,null,"","","","","","",0,0,0,0,0,0]
[{"$f":"jogo!A81","v":"14.06. 19:30"},{"$f":"jogo!B81","v":"Atlético-MG"},null,"x",null,{"$f":"jogo!D81","v":"Atlético-PR"},{"$f":"jogo!E81","v":"Independência"},null,null,null,null,null,null,null,null,null,null,null,null,null,null,null,"","","","","","",0,0,0,0,0,0]
[{"$f":"jogo!A82","v":"14.06. 19:30"},{"$f":"jogo!B82","v":"Sport Recife"},null,"x",null,{"$f":"jogo!D82","v":"São Paulo"},{"$f":"jogo!E82","v":"Ilha do Retiro"},null,null,null,null,null,null,null,null,null,null,null,null,null,null,null,"","","","","","",0,0,0,0,0,0]
[{"$f":"jogo!A83","v":"14.06. 19:30"},{"$f":"jogo!B83","v":"Vitória"},null,"x",null,{"$f":"jogo!D83","v":"Botafogo"},{"$f":"jogo!E83","v":"Barradão"},null,null,null,null,null,null,null,null,null,null,null,null,null,null,null,"","","","","","",0,0,0,0,0,0]
[{"$f":"jogo!A84","v":"14.06. 21:00"},{"$f":"jogo!B84","v":"Flamengo"},null,"x",null,{"$f":"jogo!D84","v":"Ponte Preta"},{"$f":"jogo!E84","v":"Maracanã"},null,null,null,null,null,null,null,null,null,null,null,null,null,null,null,"","","","","","",0,0,0,0,0,0]
[{"$f":"jogo!A85","v":"14.06. 21:45"},{"$f":"jogo!B85","v":"Chapecoense"},null,"x",null,{"$f":"jogo!D85","v":"Vasco"},{"$f":"jogo!E85","v":"Arena Condá"},null,null,null,null,null,null,null,null,null,null,null,null,null,null,null,"","","","","","",0,0,0,0,0,0]
[{"$f":"jogo!A86","v":"14.06. 21:45"},{"$f":"jogo!B86","v":"Corinthians"},null,"x",null,{"$f":"jogo!D86","v":"Cruzeiro"},{"$f":"jogo!E86","v":"Arena Corinthians"},null,null,null,null,null,null,null,null,null,null,null,null,null,null,null,"","","","","","",0,0,0,0,0,0]
[{"$f":"jogo!A87","v":"14.06. 21:45"},{"$f":"jogo!B87","v":"Santos"},null,"x",null,{"$f":"jogo!D87","v":"Palmeiras"},{"$f":"jogo!E87","v":"Vila Belmiro"},null,null,null,null,null,null,null,null,null,null,null,null,null,null,null,"","","","","","",0,0,0,0,0,0]
[{"$f":"jogo!A88","v":"15.06. 16:00"},{"$f":"jogo!B88","v":"Coritiba"},null,"x",null,{"$f":"jogo!D88","v":"Bahia"},{"$f":"jogo!E88","v":"Couto Pereira"},null,null,null,null,null,null,null,null,null,null,null,null,null,null,null,"","","","","","",0,0,0,0,0,0]
[{"$f":"jogo!A89","v":"15.06. 21:00"},{"$f":"jogo!B89","v":"Fluminense"},null,"x",null,{"$f":"jogo!D89","v":"Grêmio"},{"$f":"jogo!E89","v":"Maracanã"},null,null,null,null,null,null,null,null,null,null,null,null,null,null,null,"","","","","","",0,0,0,0,0,0]
["8 ª Rodada",null,null,null,null,null,null,null,null,null,null,null,null,null,null,null,null,null,null,null,null,null,"","","","","","",0,0,0,0,0,0]
["Data/Horário",null,null,null,null,null,"Local",null,null,null,null,null,null,null,null,null,null,null,null,null,null,null,"","","","","","",0,0,0,0,0,0]
[{"$f":"jogo!A92","v":"17.06. 16:00"},{"$f":"jogo!B92","v":"Atlético-GO"},null,"x",null,{"$f":"jogo!D92","v":"Atlético-PR"},{"$f":"jogo!E92","v":"Serra Dourada"},null,null,null,null,null,null,null,null,null,null,null,null,null,null,null,"","","","","","",0,0,0,0,0,0]
[{"$f":"jogo!A93","v":"17.06. 19:00"},{"$f":"jogo!B93","v":"Vasco"},null,"x",null,{"$f":"jogo!D93","v":"Avaí"},{"$f":"jogo!E93","v":"São Januário"},null,null,null,null,null,null,null,null,null,null,null,null,null,null,null,"","","","","","",0,0,0,0,0,0]
[{"$f":"jogo!A94","v":"17.06. 21:00"},{"$f":"jogo!B94","v":"Santos"},null,"x",null,{"$f":"jogo!D94","v":"Ponte Preta"},{"$f":"jogo!E94","v":"Vila Belmiro"},null,null,null,null,null,null,null,null,null,null,null,null,null,null,null,"","","","","","",0,0,0,0,0,0]
[{"$f":"jogo!A95","v":"18.06. 11:00"},{"$f":"jogo!B95","v":"Coritiba"},null,"x",null,{"$f":"jogo!D95","v":"Corinthians"},{"$f":"jogo!E95","v":"Couto Pereira"},null,null,null,null,null,null,null,null,null,null,null,null,null,null,null,"","","","","","",0,0,0,0,0,0]
[{"$f":"jogo!A96","v":"18.06. 16:00"},{"$f":"jogo!B96","v":"Bahia"},null,"x",null,{"$f":"jogo!D96","v":"Palmeiras"},{"$f":"jogo!E96","v":"Arena Fonte Nova"},null,null,null,null,null,null,null,null,null,null,null,null,null,null,null,"","","","","","",0,0,0,0,0,0]
[{"$f":"jogo!A97","v":"18.06. 16:00"},{"$f":"jogo!B97","v":"Chapecoense"},null,"x",null,{"$f":"jogo!D97","v":"Botafogo"},{"$f":"jogo!E97","v":"Arena Condá"},null,null,null,null,null,null,null,null,null,null,null,null,null,null,null,"","","","","","",0,0,0,0,0,0]
[{"$f":"jogo!A98","v":"18.06. 16:00"},{"$f":"jogo!B98","v":"Fluminense"},null,"x",null,{"$f":"jogo!D98","v":"Flamengo"},{"$f":"jogo!E98","v":"Maracanã"},null,null,null,null,null,null,null,null,null,null,null,null,null,null,null,"","","","","","",0,0,0,0,0,0]
[{"$f":"jogo!A99","v":"18.06. 16:00"},{"$f":"jogo!B99","v":"São Paulo"},null,"x",null,{"$f":"jogo!D99","v":"Atlético-MG"},{"$f":"jogo!E99","v":"Morumbi"},null,null,null,null,null,null,null,null,null,null,null,null,null,null,null,"","","","","","",0,0,0,0,0,0]
[{"$f":"jogo!A100","v":"18.06. 19:00"},{"$f":"jogo!B100","v":"Sport Recife"},null,"x",null,{"$f":"jogo!D100","v":"Vitória"},{"$f":"jogo!E100","v":"Ilha do Retiro"},null,null,null,null,null,null,null,null,null,null,null,null,null,null,null,"","","","","","",0,0,0,0,0,0]
[{"$f":"jogo!A101","v":"19.06. 20:00"},{"$f":"jogo!B101","v":"Cruzeiro"},null,"x",null,{"$f":"jogo!D101","v":"Grêmio"},{"$f":"jogo!E101","v":"Mineirão"},null,null,null,null,null,null,null,null,null,null,null,null,null,null,null,"","","","","","",0,0,0,0,0,0]
["9 ª Rodada",null,null,null,null,null,null,null,null,null,null,null,null,null,null,null,null,null,null,null,null,null,"","","","","","",0,0,0,0,0,0]
["Data/Horário",null,null,null,null,null,"Local",null,null,null,null,null,null,null,null,null,null,null,null,null,null,null,"","","","","","",0,0,0,0,0,0]
[{"$f":"jogo!A104","v":"21.06. 19:30"},{"$f":"jogo!B104","v":"Vitória"},null,"x",null,{"$f":"jogo!D104","v":"Santos"},{"$f":"jogo!E104","v":"Barradão"},null,null,null,null,null,null,null,null,null,null,null,null,null,null,null,"","","","","","",0,0,0,0,0,0]
[{"$f":"jogo!A105","v":"21.06. 21:00"},{"$f":"jogo!B105","v":"Botafogo"},null,"x",null,{"$f":"jogo!D105","v":"Vasco"},{"$f":"jogo!E105","v":"Nilton Santos"},null,null,null,null,null,null,null,null,null,null,null,null,null,null,null,"","","","","","",0,0,0,0,0,0]
[{"$f":"jogo!A106","v":"21.06. 21:00"},{"$f":"jogo!B106","v":"Palmeiras"},null,"x",null,{"$f":"jogo!D106","v":"Atlético-GO"},{"$f":"jogo!E106","v":"Allianz Parque"},null,null,null,null,null,null,null,null,null,null,null,null,null,null,null,"","","","","","",0,0,0,0,0,0]
[{"$f":"jogo!A107","v":"21.06. 21:45"},{"$f":"jogo!B107","v":"Atlético-MG"},null,"x",null,{"$f":"jogo!D107","v":"Sport Recife"},{"$f":"jogo!E107","v":"Independência"},null,null,null,null,null,null,null,null,null,null,null,null,null,null,null,"","","","","","",0,0,0,0,0,0]
[{"$f":"jogo!A108","v":"21.06. 21:45"},{"$f":"jogo!B108","v":"Atlético-PR"},null,"x",null,{"$f":"jogo!D108","v":"São Paulo"},{"$f":"jogo!E108","v":"Arena da Baixada"},null,null,null,null,null,null,null,null,null,null,null,null,null,null,null,"","","","","","",0,0,0,0,0,0]
[{"$f":"jogo!A109","v":"21.06. 21:45"},{"$f":"jogo!B109","v":"Avaí"},null,"x",null,{"$f":"jogo!D109","v":"Fluminense"},{"$f":"jogo!E109","v":"Ressacada"},null,null,null,null,null,null,null,null,null,null,null,null,null,null,null,"","","","","","",0,0,0,0,0,0]
[{"$f":"jogo!A110","v":"22.06. 19:30"},{"$f":"jogo!B110","v":"Flamengo"},null,"x",null,{"$f":"jogo!D110","v":"Chapecoense"},{"$f":"jogo!E110","v":"Maracanã"},null,null,null,null,null,null,null,null,null,null,null,null,null,null,null,"","","","","","",0,0,0,0,0,0]
[{"$f":"jogo!A111","v":"22.06. 19:30"},{"$f":"jogo!B111","v":"Ponte Preta"},null,"x",null,{"$f":"jogo!D111","v":"Cruzeiro"},{"$f":"jogo!E111","v":"Moisés Lucarelli"},null,null,null,null,null,null,null,null,null,null,null,null,null,null,null,"","","","","","",0,0,0,0,0,0]
[{"$f":"jogo!A112","v":"22.06. 21:00"},{"$f":"jogo!B112","v":"Corinthians"},null,"x",null,{"$f":"jogo!D112","v":"Bahia"},{"$f":"jogo!E112","v":"Arena Corinthians"},null,null,null,null,null,null,null,null,null,null,null,null,null,null,null,"","","","","","",0,0,0,0,0,0]
[{"$f":"jogo!A113","v":"22.06. 21:00"},{"$f":"jogo!B113","v":"Grêmio"},null,"x",null,{"$f":"jogo!D113","v":"Coritiba"},{"$f":"jogo!E113","v":"Arena do Grêmio"},null,null,null,null,null,null,null,null,null,null,null,null,null,null,null,"","","","","","",0,0,0,0,0,0]
["10 ª Rodada",null,null,null,null,null,null,null,null,null,null,null,null,null,null,null,null,null,null,null,null,null,"","","","","","",0,0,0,0,0,0]
["Data/Horário",null,null,null,null,null,"Local",null,null,null,null,null,null,null,null,null,null,null,null,null,null,null,"","","","","","",0,0,0,0,0,0]
[{"$f":"jogo!A116","v":"24.06. 19:00"},{"$f":"jogo!B116","v":"Santos"},null,"x",null,{"$f":"jogo!D116","v":"Sport Recife"},{"$f":"jogo!E116","v":"Vila Belmiro"},null,null,null,null,null,null,null,null,null,null,null,null,null,null,null,"","","","","","",0,0,0,0,0,0]
[{"$f":"jogo!A117","v":"25.06. 11:00"},{"$f":"jogo!B117","v":"Vasco"},null,"x",null,{"$f":"jogo!D117","v":"Atlético-GO"},{"$f":"jogo!E117","v":"São Januário"},null,null,null,null,null,null,null,null,null,null,null,null,null,null,null,"","","","","","",0,0,0,0,0,0]
[{"$f":"jogo!A118","v":"25.06. 16:00"},{"$f":"jogo!B118","v":"Atlético-PR"},null,"x",null,{"$f":"jogo!D118","v":"Vitória"},{"$f":"jogo!E118","v":"Arena da Baixada"},null,null,null,null,null,null,null,null,null,null,null,null,null,null,null,"","","","","","",0,0,0,0,0,0]
[{"$f":"jogo!A119","v":"25.06. 16:00"},{"$f":"jogo!B119","v":"Cruzeiro"},null,"x",null,{"$f":"jogo!D119","v":"Coritiba"},{"$f":"jogo!E119","v":"Mineirão"},null,null,null,null,null,null,null,null,null,null,null,null,null,null,null,"","","","","","",0,0,0,0,0,0]
[{"$f":"jogo!A120","v":"25.06. 16:00"},{"$f":"jogo!B120","v":"Grêmio"},null,"x",null,{"$f":"jogo!D120","v":"Corinthians"},{"$f":"jogo!E120","v":"Arena do Grêmio"},null,null,null,null,null,null,null,null,null,null,null,null,null,null,null,"","","","","","",0,0,0,0,0,0]
[{"$f":"jogo!A121","v":"25.06. 16:00"},{"$f":"jogo!B121","v":"Ponte Preta"},null,"x",null,{"$f":"jogo!D121","v":"Palmeiras"},{"$f":"jogo!E121","v":"Moisés Lucarelli"},null,null,null,null,null,null,null,null,null,null,null,null,null,null,null,"","","","","","",0,0,0,0,0,0]
[{"$f":"jogo!A122","v":"25.06. 16:00"},{"$f":"jogo!B122","v":"São Paulo"},null,"x",null,{"$f":"jogo!D122","v":"Fluminense"},{"$f":"jogo!E122","v":"Morumbi"},null,null,null,null,null,null,null,null,null,null,null,null,null,null,null,"","","","","","",0,0,0,0,0,0]
[{"$f":"jogo!A123","v":"25.06. 18:30"},{"$f":"jogo!B123","v":"Bahia"},null,"x",null,{"$f":"jogo!D123","v":"Flamengo"},{"$f":"jogo!E123","v":"Arena Fonte Nova"},null,null,null,null,null,null,null,null,null,null,null,null,null,null,null,"","","","","","",0,0,0,0,0,0]
[{"$f":"jogo!A124","v":"25.06. 19:00"},{"$f":"jogo!B124","v":"Chapecoense"},null,"x",null,{"$f":"jogo!D124","v":"Atlético-MG"},{"$f":"jogo!E124","v":"Arena Condá"},null,null,null,null,null,null,null,null,null,null,null,null,null,null,null,"","","","","","",0,0,0,0,0,0]
[{"$f":"jogo!A125","v":"26.06. 20:00"},{"$f":"jogo!B125","v":"Botafogo"},null,"x",null,{"$f":"jogo!D125","v":"Avaí"},{"$f":"jogo!E125","v":"Nilton Santos"},null,null,null,null,null,null,null,null,null,null,null,null,null,null,null,"","","","","","",0,0,0,0,0,0]
["11 ª Rodada",null,null,null,null,null,null,null,null,null,null,null,null,null,null,null,null,null,null,null,null,null,"","","","","","",0,0,0,0,0,0]
["Data/Horário",null,null,null,null,null,"Local",null,null,null,null,null,null,null,null,null,null,null,null,null,null,null,"","","","","","",0,0,0,0,0,0]
[{"$f":"jogo!A128","v":"20.06. 17:00"},{"$f":"jogo!B128","v":"Fluminense"},null,"x",null,{"$f":"jogo!D128","v":"Chapecoense"},{"$f":"jogo!E128","v":"Maracanã"},null,null,null,null,null,null,null,null,null,null,null,null,null,null,null,"","","","","","",0,0,0,0,0,0]
[{"$f":"jogo!A129","v":"01.07. 17:00"},{"$f":"jogo!B129","v":"Atlético-GO"},null,"x",null,{"$f":"jogo!D129","v":"Santos"},{"$f":"jogo!E129","v":"Serra Dourada"},null,null,null,null,null,null,null,null,null,null,null,null,null,null,null,"","","","","","",0,0,0,0,0,0]
[{"$f":"jogo!A130","v":"01.07. 17:00"},{"$f":"jogo!B130","v":"Atlético-MG"},null,"x",null,{"$f":"jogo!D130","v":"Cruzeiro"},{"$f":"jogo!E130","v":"Independência"},null,null,null,null,null,null,null,null,null,null,null,null,null,null,null,"","","","","","",0,0,0,0,0,0]
[{"$f":"jogo!A131","v":"01.07. 17:00"},{"$f":"jogo!B131","v":"Avaí"},null,"x",null,{"$f":"jogo!D131","v":"Ponte Preta"},{"$f":"jogo!E131","v":"Ressacada"},null,null,null,null,null,null,null,null,null,null,null,null,null,null,null,"","","","","","",0,0,0,0,0,0]
[{"$f":"jogo!A132","v":"01.07. 17:00"},{"$f":"jogo!B132","v":"Corinthians"},null,"x",null,{"$f":"jogo!D132","v":"Botafogo"},{"$f":"jogo!E132","v":"Arena Corinthians"},null,null,null,null,null,null,null,null,null,null,null,null,null,null,null,"","","","","","",0,0,0,0,0,0]
[{"$f":"jogo!A133","v":"01.07. 17:00"},{"$f":"jogo!B133","v":"Coritiba"},null,"x",null,{"$f":"jogo!D133","v":"Vasco"},{"$f":"jogo!E133","v":"Couto Pereira"},null,null,null,null,null,null,null,null,null,null,null,null,null,null,null,"","","","","","",0,0,0,0,0,0]
[{"$f":"jogo!A134","v":"01.07. 17:00"},{"$f":"jogo!B134","v":"Flamengo"},null,"x",null,{"$f":"jogo!D134","v":"São Paulo"},{"$f":"jogo!E134","v":"Maracanã"},null,null,null,null,null,null,null,null,null,null,null,null,null,null,null,{"$f":"IF(C134&E134=\"\",\"\",IF(C134=E134,1,IF(C134>E134,3,IF(C134<E134,0))))","v":""},{"$f":"IF(C134&E134=\"\",\"\",IF(E134=C134,1,IF(C134<E134,3,IF(C134>E134,0))))","v":""},{"$f":"IF(C134&E134=\"\",\"\",IF(C134&E134<>\"\",1))","v":""},{"$f":"IF(C134&E134=\"\",\"\",IF(C134&E134<>\"\",1))","v":""},{"$f":"IF(C134=\"\",\"\",C134)","v":""},{"$f":"IF(E134=\"\",\"\",E134)","v":""},0,0,0,0,0,0]
[{"$f":"jogo!A135","v":"01.07. 17:00"},{"$f":"jogo!B135","v":"Palmeiras"},null,"x",null,{"$f":"jogo!D135","v":"Grêmio"},{"$f":"jogo!E135","v":"Allianz Parque"},null,null,null,null,null,null,null,null,null,null,null,null,null,null,null,"","","","","","",{"$f":"IF(W135=3,1,0)","v":0},{"$f":"IF(X135=3,1,0)","v":0},{"$f":"IF(W135=1,1,0)","v":0},{"$f":"IF(X135=1,1,0)","v":0},{"$f":"IF(W135=0,1,0)","v":0},{"$f":"IF(X135=0,1,0)","v":0}]
[{"$f":"jogo!A136","v":"01.07. 17:00"},{"$f":"jogo!B136","v":"Sport Recife"},null,"x",null,{"$f":"jogo!D136","v":"Atlético-PR"},{"$f":"jogo!E136","v":"Ilha do Retiro"},null,null,null,null,null,null,null,null,null,null,null,null,null,null,null,"","","","","","",0,0,0,0,0,0]
[{"$f":"jogo!A137","v":"01.07. 17:00"},{"$f":"jogo!B137","v":"Vitória"},null,"x",null,{"$f":"jogo!D137","v":"Bahia"},{"$f":"jogo!E137","v":"Barradão"},null,null,null,null,null,null,null,null,null,null,null,null,null,null,null,"","","","","","",0,0,0,0,0,0]
["12 ª Rodada",null,null,null,null,null,null,null,null,null,null,null,null,null,null,null,null,null,null,null,null,null,"","","","","","",0,0,0,0,0,0]
["Data/Horário",null,null,null,null,null,"Local",null,null,null,null,null,null,null,null,null,null,null,null,null,null,null,"","","","","","",0,0,0,0,0,0]
[{"$f":"jogo!A140","v":"08.07. 17:00"},{"$f":"jogo!B140","v":"Atlético-GO"},null,"x",null,{"$f":"jogo!D140","v":"Vitória"},{"$f":"jogo!E140","v":"Serra Dourada"},null,null,null,null,null,null,null,null,null,null,null,null,null,null,null,"","","","","","",0,0,0,0,0,0]
[{"$f":"jogo!A141","v":"08.07. 17:00"},{"$f":"jogo!B141","v":"Bahia"},null,"x",null,{"$f":"jogo!D141","v":"Fluminense"},{"$f":"jogo!E141","v":"Arena Fonte Nova"},null,null,null,null,null,null,null,null,null,null,null,null,null,null,null,"","","","","","",0,0,0,0,0,0]
[{"$f":"jogo!A142","v":"08.07. 17:00"},{"$f":"jogo!B142","v":"Botafogo"},null,"x",null,{"$f":"jogo!D142","v":"Atlético-MG"},{"$f":"jogo!E142","v":"Nilton Santos"},null,null,null,null,null,null,null,null,null,null,null,null,null,null,null,"","","","","","",0,0,0,0,0,0]
[{"$f":"jogo!A143","v":"08.07. 17:00"},{"$f":"jogo!B143","v":"Chapecoense"},null,"x",null,{"$f":"jogo!D143","v":"Atlético-PR"},{"$f":"jogo!E143","v":"Arena Condá"},null,null,null,null,null,null,null,null,null,null,null,null,null,null,null,"","","","","","",0,0,0,0,0,0]
[{"$f":"jogo!A144","v":"08.07. 17:00"},{"$f":"jogo!B144","v":"Corinthians"},null,"x",null,{"$f":"jogo!D144","v":"Ponte Preta"},{"$f":"jogo!E144","v":"Arena Corinthians"},null,null,null,null,null,null,null,null,null,null,null,null,null,null,null,"","","","","","",0,0,0,0,0,0]
[{"$f":"jogo!A145","v":"08.07. 17:00"},{"$f":"jogo!B145","v":"Coritiba"},null,"x",null,{"$f":"jogo!D145","v":"Sport Recife"},{"$f":"jogo!E145","v":"Couto Pereira"},null,null,null,null,null,null,null,null,null,null,null,null,null,null,null,"","","","","","",0,0,0,0,0,0]
[{"$f":"jogo!A146","v":"08.07. 17:00"},{"$f":"jogo!B146","v":"Cruzeiro"},null,"x",null,{"$f":"jogo!D146","v":"Palmeiras"},{"$f":"jogo!E146","v":"Mineirão"},null,null,null,null,null,null,null,null,null,null,null,null,null,null,null,"","","","","","",0,0,0,0,0,0]
[{"$f":"jogo!A147","v":"08.07. 17:00"},{"$f":"jogo!B147","v":"Grêmio"},null,"x",null,{"$f":"jogo!D147","v":"Avaí"},{"$f":"jogo!E147","v":"Arena do Grêmio"},null,null,null,null,null,null,null,null,null,null,null,null,null,null,null,"","","","","","",0,0,0,0,0,0]
[{"$f":"jogo!A148","v":"08.07. 17:00"},{"$f":"jogo!B148","v":"Santos"},null,"x",null,{"$f":"jogo!D148","v":"São Paulo"},{"$f":"jogo!E148","v":"Vila Belmiro"},null,null,null,null,null,null,null,null,null,null,null,null,null,null,null,"","","","","","",0,0,0,0,0,0]
[{"$f":"jogo!A149","v":"08.07. 17:00"},{"$f":"jogo!B149","v":"Vasco"},null,"x",null,{"$f":"jogo!D149","v":"Flamengo"},{"$f":"jogo!E149","v":"São Januário"},null,null,null,null,null,null,null,null,null,null,null,null,null,null,null,"","","","","","",0,0,0,0,0,0]
["13 ª Rodada",null,null,null,null,null,null,null,null,null,null,null,null,null,null,null,null,null,null,null,null,null,"","","","","","",0,0,0,0,0,0]
["Data/Horário",null,null,null,null,null,"Local",null,null,null,null,null,null,null,null,null,null,null,null,null,null,null,"","","","","","",0,0,0,0,0,0]
[{"$f":"jogo!A152","v":"12.07. 17:00"},{"$f":"jogo!B152","v":"Atlético-MG"},null,"x",null,{"$f":"jogo!D152","v":"Santos"},{"$f":"jogo!E152","v":"Independência"},null,null,null,null,null,null,null,null,null,null,null,null,null,null,null,"","","","","","",0,0,0,0,0,0]
[{"$f":"jogo!A153","v":"12.07. 17:00"},{"$f":"jogo!B153","v":"Atlético-PR"},null,"x",null,{"$f":"jogo!D153","v":"Cruzeiro"},{"$f":"jogo!E153","v":"Arena da Baixada"},null,null,null,null,null,null,null,null,null,null,null,null,null,null,null,"","","","","","",0,0,0,0,0,0]
[{"$f":"jogo!A154","v":"12.07. 17:00"},{"$f":"jogo!B154","v":"Avaí"},null,"x",null,{"$f":"jogo!D154","v":"Coritiba"},{"$f":"jogo!E154","v":"Ressacada"},null,null,null,null,null,null,null,null,null,null,null,null,null,null,null,"","","","","","",0,0,0,0,0,0]
[{"$f":"jogo!A155","v":"12.07. 17:00"},{"$f":"jogo!B155","v":"Flamengo"},null,"x",null,{"$f":"jogo!D155","v":"Grêmio"},{"$f":"jogo!E155","v":"Maracanã"},null,null,null,null,null,null,null,null,null,null,null,null,null,null,null,"","","","","","",0,0,0,0,0,0]
[{"$f":"jogo!A156","v":"12.07. 17:00"},{"$f":"jogo!B156","v":"Fluminense"},null,"x",null,{"$f":"jogo!D156","v":"Botafogo"},{"$f":"jogo!E156","v":"Maracanã"},null,null,null,null,null,null,null,null,null,null,null,null,null,null,null,"","","","","","",0,0,0,0,0,0]
[{"$f":"jogo!A157","v":"12.07. 17:00"},{"$f":"jogo!B157","v":"Palmeiras"},null,"x",null,{"$f":"jogo!D157","v":"Corinthians"},{"$f":"jogo!E157","v":"Allianz Parque"},null,null,null,null,null,null,null,null,null,null,null,null,null,null,null,"","","","","","",0,0,0,0,0,0]
[{"$f":"jogo!A158","v":"12.07. 17:00"},{"$f":"jogo!B158","v":"Ponte Preta"},null,"x",null,{"$f":"jogo!D158","v":"Bahia"},{"$f":"jogo!E158","v":"Moisés Lucarelli"},null,null,null,null,null,null,null,null,null,null,null,null,null,null,null,"","","","","","",0,0,0,0,0,0]
[{"$f":"jogo!A159","v":"12.07. 17:00"},{"$f":"jogo!B159","v":"São Paulo"},null,"x",null,{"$f":"jogo!D159","v":"Atlético-GO"},{"$f":"jogo!E159","v":"Morumbi"},null,null,null,null,null,null,null,null,null,null,null,null,null,null,null,"","","","","","",0,0,0,0,0,0]
[{"$f":"jogo!A160","v":"12.07. 17:00"},{"$f":"jogo!B160","v":"Sport Recife"},null,"x",null,{"$f":"jogo!D160","v":"Chapecoense"},{"$f":"jogo!E160","v":"Ilha do Retiro"},null,null,null,null,null,null,null,null,null,null,null,null,null,null,null,"","","","","","",0,0,0,0,0,0]
[{"$f":"jogo!A161","v":"12.07. 17:00"},{"$f":"jogo!B161","v":"Vitória"},null,"x",null,{"$f":"jogo!D161","v":"Vasco"},{"$f":"jogo!E161","v":"Barradão"},null,null,null,null,null,null,null,null,null,null,null,null,null,null,null,"","","","","","",0,0,0,0,0,0]
["14 ª Rodada",null,null,null,null,null,null,null,null,null,null,null,null,null,null,null,null,null,null,null,null,null,"","","","","","",0,0,0,0,0,0]
["Data/Horário",null,null,null,null,null,"Local",null,null,null,null,null,null,null,null,null,null,null,null,null,null,null,"","","","","","",0,0,0,0,0,0]
[{"$f":"jogo!A164","v":"15.07. 17:00"},{"$f":"jogo!B164","v":"Atlético-GO"},null,"x",null,{"$f":"jogo!D164","v":"Atlético-MG"},{"$f":"jogo!E164","v":"Serra Dourada"},null,null,null,null,null,null,null,null,null,null,null,null,null,null,null,"","","","","","",0,0,0,0,0,0]
[{"$f":"jogo!A165","v":"15.07. 17:00"},{"$f":"jogo!B165","v":"Bahia"},null,"x",null,{"$f":"jogo!D165","v":"Avaí"},{"$f":"jogo!E165","v":"Arena Fonte Nova"},null,null,null,null,null,null,null,null,null,null,null,null,null,null,null,"","","","","","",0,0,0,0,0,0]
[{"$f":"jogo!A166","v":"15.07. 17:00"},{"$f":"jogo!B166","v":"Botafogo"},null,"x",null,{"$f":"jogo!D166","v":"Sport Recife"},{"$f":"jogo!E166","v":"Nilton Santos"},null,null,null,null,null,null,null,null,null,null,null,null,null,null,null,"","","","","","",0,0,0,0,0,0]
[{"$f":"jogo!A167","v":"15.07. 17:00"},{"$f":"jogo!B167","v":"Chapecoense"},null,"x",null,{"$f":"jogo!D167","v":"São Paulo"},{"$f":"jogo!E167","v":"Arena Condá"},null,null,null,null,null,null,null,null,null,null,null,null,null,null,null,"","","","","","",0,0,0,0,0,0]
[{"$f":"jogo!A168","v":"15.07. 17:00"},{"$f":"jogo!B168","v":"Corinthians"},null,"x",null,{"$f":"jogo!D168","v":"Atlético-PR"},{"$f":"jogo!E168","v":"Arena Corinthians"},null,null,null,null,null,null,null,null,null,null,null,null,null,null,null,"","","","","","",0,0,0,0,0,0]
[{"$f":"jogo!A169","v":"15.07. 17:00"},{"$f":"jogo!B169","v":"Coritiba"},null,"x",null,{"$f":"jogo!D169","v":"Fluminense"},{"$f":"jogo!E169","v":"Couto Pereira"},null,null,null,null,null,null,null,null,null,null,null,null,null,null,null,"","","","","","",0,0,0,0,0,0]
[{"$f":"jogo!A170","v":"15.07. 17:00"},{"$f":"jogo!B170","v":"Cruzeiro"},null,"x",null,{"$f":"jogo!D170","v":"Flamengo"},{"$f":"jogo!E170","v":"Mineirão"},null,null,null,null,null,null,null,null,null,null,null,null,null,null,null,"","","","","","",0,0,0,0,0,0]
[{"$f":"jogo!A171","v":"15.07. 17:00"},{"$f":"jogo!B171","v":"Grêmio"},null,"x",null,{"$f":"jogo!D171","v":"Ponte Preta"},{"$f":"jogo!E171","v":"Arena do Grêmio"},null,null,null,null,null,null,null,null,null,null,null,null,null,null,null,"","","","","","",0,0,0,0,0,0]
[{"$f":"jogo!A172","v":"15.07. 17:00"},{"$f":"jogo!B172","v":"Palmeiras"},null,"x",null,{"$f":"jogo!D172","v":"Vitória"},{"$f":"jogo!E172","v":"Allianz Parque"},null,null,null,null,null,null,null,null,null,null,null,null,null,null,null,"","","","","","",0,0,0,0,0,0]
[{"$f":"jogo!A173","v":"15.07. 17:00"},{"$f":"jogo!B173","v":"Vasco"},null,"x",null,{"$f":"jogo!D173","v":"Santos"},{"$f":"jogo!E173","v":"São Januário"},null,null,null,null,null,null,null,null,null,null,null,null,null,null,null,"","","","","","",0,0,0,0,0,0]
["15 ª Rodada",null,null,null,null,null,null,null,null,null,null,null,null,null,null,null,null,null,null,null,null,null,"","","","","","",0,0,0,0,0,0]
["Data/Horário",null,null,null,null,null,"Local",null,null,null,null,null,null,null,null,null,null,null,null,null,null,null,"","","","","","",0,0,0,0,0,0]
[{"$f":"jogo!A176","v":"19.07. 17:00"},{"$f":"jogo!B176","v":"Atlético-MG"},null,"x",null,{"$f":"jogo!D176","v":"Bahia"},{"$f":"jogo!E176","v":"Independência"},null,null,null,null,null,null,null,null,null,null,null,null,null,null,null,"","","","","","",0,0,0,0,0,0]
[{"$f":"jogo!A177","v":"19.07. 17:00"},{"$f":"jogo!B177","v":"Atlético-PR"},null,"x",null,{"$f":"jogo!D177","v":"Botafogo"},{"$f":"jogo!E177","v":"Arena da Baixada"},null,null,null,null,null,null,null,null,null,null,null,null,null,null,null,"","","","","","",0,0,0,0,0,0]
[{"$f":"jogo!A178","v":"19.07. 17:00"},{"$f":"jogo!B178","v":"Avaí"},null,"x",null,{"$f":"jogo!D178","v":"Corinthians"},{"$f":"jogo!E178","v":"Ressacada"},null,null,null,null,null,null,null,null,null,null,null,null,null,null,null,"","","","","","",0,0,0,0,0,0]
[{"$f":"jogo!A179","v":"19.07. 17:00"},{"$f":"jogo!B179","v":"Flamengo"},null,"x",null,{"$f":"jogo!D179","v":"Palmeiras"},{"$f":"jogo!E179","v":"Maracanã"},null,null,null,null,null,null,null,null,null,null,null,null,null,null,null,"","","","","","",0,0,0,0,0,0]
[{"$f":"jogo!A180","v":"19.07. 17:00"},{"$f":"jogo!B180","v":"Fluminense"},null,"x",null,{"$f":"jogo!D180","v":"Cruzeiro"},{"$f":"jogo!E180","v":"Maracanã"},null,null,null,null,null,null,null,null,null,null,null,null,null,null,null,"","","","","","",0,0,0,0,0,0]
[{"$f":"jogo!A181","v":"19.07. 17:00"},{"$f":"jogo!B181","v":"Ponte Preta"},null,"x",null,{"$f":"jogo!D181","v":"Coritiba"},{"$f":"jogo!E181","v":"Moisés Lucarelli"},null,null,null,null,null,null,null,null,null,null,null,null,null,null,null,"","","","","","",0,0,0,0,0,0]
[{"$f":"jogo!A182","v":"19.07. 17:00"},{"$f":"jogo!B182","v":"Santos"},null,"x",null,{"$f":"jogo!D182","v":"Chapecoense"},{"$f":"jogo!E182","v":"Vila Belmiro"},null,null,null,null,null,null,null,null,null,null,null,null,null,null,null,"","","","","","",0,0,0,0,0,0]
[{"$f":"jogo!A183","v":"19.07. 17:00"},{"$f":"jogo!B183","v":"São Paulo"},null,"x",null,{"$f":"jogo!D183","v":"Vasco"},{"$f":"jogo!E183","v":"Morumbi"},null,null,null,null,null,null,null,null,null,null,null,null,null,null,null,"","","","","","",0,0,0,0,0,0]
[{"$f":"jogo!A184","v":"19.07. 17:00"},{"$f":"jogo!B184","v":"Sport Recife"},null,"x",null,{"$f":"jogo!D184","v":"Atlético-GO"},{"$f":"jogo!E184","v":"Ilha do Retiro"},null,null,null,null,null,null,null,null,null,null,null,null,null,null,null,"","","","","","",0,0,0,0,0,0]
[{"$f":"jogo!A185","v":"19.07. 17:00"},{"$f":"jogo!B185","v":"Vitória"},null,"x",null,{"$f":"jogo!D185","v":"Grêmio"},{"$f":"jogo!E185","v":"Barradão"},null,null,null,null,null,null,null,null,null,null,null,null,null,null,null,"","","","","","",0,0,0,0,0,0]
["16 ª Rodada",null,null,null,null,null,null,null,null,null,null,null,null,null,null,null,null,null,null,null,null,null,"","","","","","",0,0,0,0,0,0]
["Data/Horário",null,null,null,null,null,"Local",null,null,null,null,null,null,null,null,null,null,null,null,null,null,null,"","","","","","",0,0,0,0,0,0]
[{"$f":"jogo!A188","v":"22.07. 17:00"},{"$f":"jogo!B188","v":"Atlético-GO"},null,"x",null,{"$f":"jogo!D188","v":"Botafogo"},{"$f":"jogo!E188","v":"Serra Dourada"},null,null,null,null,null,null,null,null,null,null,null,null,null,null,null,"","","","","","",0,0,0,0,0,0]
[{"$f":"jogo!A189","v":"22.07. 17:00"},{"$f":"jogo!B189","v":"Atlético-MG"},null,"x",null,{"$f":"jogo!D189","v":"Vasco"},{"$f":"jogo!E189","v":"Independência"},null,null,null,null,null,null,null,null,null,null,null,null,null,null,null,"","","","","","",0,0,0,0,0,0]
[{"$f":"jogo!A190","v":"22.07. 17:00"},{"$f":"jogo!B190","v":"Atlético-PR"},null,"x",null,{"$f":"jogo!D190","v":"Ponte Preta"},{"$f":"jogo!E190","v":"Arena da Baixada"},null,null,null,null,null,null,null,null,null,null,null,null,null,null,null,"","","","","","",0,0,0,0,0,0]
[{"$f":"jogo!A191","v":"22.07. 17:00"},{"$f":"jogo!B191","v":"Avaí"},null,"x",null,{"$f":"jogo!D191","v":"Cruzeiro"},{"$f":"jogo!E191","v":"Ressacada"},null,null,null,null,null,null,null,null,null,null,null,null,null,null,null,"","","","","","",0,0,0,0,0,0]
[{"$f":"jogo!A192","v":"22.07. 17:00"},{"$f":"jogo!B192","v":"Flamengo"},null,"x",null,{"$f":"jogo!D192","v":"Coritiba"},{"$f":"jogo!E192","v":"Maracanã"},null,null,null,null,null,null,null,null,null,null,null,null,null,null,null,"","","","","","",0,0,0,0,0,0]
[{"$f":"jogo!A193","v":"22.07. 17:00"},{"$f":"jogo!B193","v":"Fluminense"},null,"x",null,{"$f":"jogo!D193","v":"Corinthians"},{"$f":"jogo!E193","v":"Maracanã"},null,null,null,null,null,null,null,null,null,null,null,null,null,null,null,"","","","","","",0,0,0,0,0,0]
[{"$f":"jogo!A194","v":"22.07. 17:00"},{"$f":"jogo!B194","v":"Santos"},null,"x",null,{"$f":"jogo!D194","v":"Bahia"},{"$f":"jogo!E194","v":"Vila Belmiro"},null,null,null,null,null,null,null,null,null,null,null,null,null,null,null,"","","","","","",0,0,0,0,0,0]
[{"$f":"jogo!A195","v":"22.07. 17:00"},{"$f":"jogo!B195","v":"São Paulo"},null,"x",null,{"$f":"jogo!D195","v":"Grêmio"},{"$f":"jogo!E195","v":"Morumbi"},null,null,null,null,null,null,null,null,null,null,null,null,null,null,null,"","","","","","",0,0,0,0,0,0]
[{"$f":"jogo!A196","v":"22.07. 17:00"},{"$f":"jogo!B196","v":"Sport Recife"},null,"x",null,{"$f":"jogo!D196","v":"Palmeiras"},{"$f":"jogo!E196","v":"Ilha do Retiro"},null,null,null,null,null,null,null,null,null,null,null,null,null,null,null,"","","","","","",0,0,0,0,0,0]
[{"$f":"jogo!A197","v":"22.07. 17:00"},{"$f":"jogo!B197","v":"Vitória"},null,"x",null,{"$f":"jogo!D197","v":"Chapecoense"},{"$f":"jogo!E197","v":"Barradão"},null,null,null,null,null,null,null,null,null,null,null,null,null,null,null,"","","","","","",0,0,0,0,0,0]
["17 ª Rodada",null,null,null,null,null,null,null,null,null,null,null,null,null,null,null,null,null,null,null,null,null,{"$f":"IF(C198&E198=\"\",\"\",IF(C198=E198,1,IF(C198>E198,3,IF(C198<E198,0))))","v":""},{"$f":"IF(C198&E198=\"\",\"\",IF(E198=C198,1,IF(C198<E198,3,IF(C198>E198,0))))","v":""},{"$f":"IF(C198&E198=\"\",\"\",IF(C198&E198<>\"\",1))","v":""},{"$f":"IF(C198&E198=\"\",\"\",IF(C198&E198<>\"\",1))","v":""},{"$f":"IF(C198=\"\",\"\",C198)","v":""},{"$f":"IF(E198=\"\",\"\",E198)","v":""},0,0,0,0,0,0]
["Data/Horário",null,null,null,null,null,"Local",null,null,null,null,null,null,null,null,null,null,null,null,null,null,null,"","","","","","",{"$f":"IF(W199=3,1,0)","v":0},{"$f":"IF(X199=3,1,0)","v":0},{"$f":"IF(W199=1,1,0)","v":0},{"$f":"IF(X199=1,1,0)","v":0},{"$f":"IF(W199=0,1,0)","v":0},{"$f":"IF(X199=0,1,0)","v":0}]
[{"$f":"jogo!A200","v":"29.07. 17:00"},{"$f":"jogo!B200","v":"Bahia"},null,"x",null,{"$f":"jogo!D200","v":"Sport Recife"},{"$f":"jogo!E200","v":"Arena Fonte Nova"},null,null,null,null,null,null,null,null,null,null,null,null,null,null,null,"","","","","","",0,0,0,0,0,0]
[{"$f":"jogo!A201","v":"29.07. 17:00"},{"$f":"jogo!B201","v":"Botafogo"},null,"x",null,{"$f":"jogo!D201","v":"São Paulo"},{"$f":"jogo!E201","v":"Nilton Santos"},null,null,null,null,null,null,null,null,null,null,null,null,null,null,null,"","","","","","",0,0,0,0,0,0]
[{"$f":"jogo!A202","v":"29.07. 17:00"},{"$f":"jogo!B202","v":"Chapecoense"},null,"x",null,{"$f":"jogo!D202","v":"Atlético-GO"},{"$f":"jogo!E202","v":"Arena Condá"},null,null,null,null,null,null,null,null,null,null,null,null,null,null,null,"","","","","","",0,0,0,0,0,0]
[{"$f":"jogo!A203","v":"29.07. 17:00"},{"$f":"jogo!B203","v":"Corinthians"},null,"x",null,{"$f":"jogo!D203","v":"Flamengo"},{"$f":"jogo!E203","v":"Arena Corinthians"},null,null,null,null,null,null,null,null,null,null,null,null,null,null,null,"","","","","","",0,0,0,0,0,0]
[{"$f":"jogo!A204","v":"29.07. 17:00"},{"$f":"jogo!B204","v":"Coritiba"},null,"x",null,{"$f":"jogo!D204","v":"Atlético-MG"},{"$f":"jogo!E204","v":"Couto Pereira"},null,null,null,null,null,null,null,null,null,null,null,null,null,null,null,"","","","","","",0,0,0,0,0,0]
[{"$f":"jogo!A205","v":"29.07. 17:00"},{"$f":"jogo!B205","v":"Cruzeiro"},null,"x",null,{"$f":"jogo!D205","v":"Vitória"},{"$f":"jogo!E205","v":"Mineirão"},null,null,null,null,null,null,null,null,null,null,null,null,null,null,null,"","","","","","",0,0,0,0,0,0]
[{"$f":"jogo!A206","v":"29.07. 17:00"},{"$f":"jogo!B206","v":"Grêmio"},null,"x",null,{"$f":"jogo!D206","v":"Santos"},{"$f":"jogo!E206","v":"Arena do Grêmio"},null,null,null,null,null,null,null,null,null,null,null,null,null,null,null,"","","","","","",0,0,0,0,0,0]
[{"$f":"jogo!A207","v":"29.07. 17:00"},{"$f":"jogo!B207","v":"Palmeiras"},null,"x",null,{"$f":"jogo!D207","v":"Avaí"},{"$f":"jogo!E207","v":"Allianz Parque"},null,null,null,null,null,null,null,null,null,null,null,null,null,null,null,"","","","","","",0,0,0,0,0,0]
[{"$f":"jogo!A208","v":"29.07. 17:00"},{"$f":"jogo!B208","v":"Ponte Preta"},null,"x",null,{"$f":"jogo!D208","v":"Fluminense"},{"$f":"jogo!E208","v":"Moisés Lucarelli"},null,null,null,null,null,null,null,null,null,null,null,null,null,null,null,"","","","","","",0,0,0,0,0,0]
[{"$f":"jogo!A209","v":"29.07. 17:00"},{"$f":"jogo!B209","v":"Vasco"},null,"x",null,{"$f":"jogo!D209","v":"Atlético-PR"},{"$f":"jogo!E209","v":"São Januário"},null,null,null,null,null,null,null,null,null,null,null,null,null,null,null,"","","","","","",0,0,0,0,0,0]
["18 ª Rodada",null,null,null,null,null,null,null,null,null,null,null,null,null,null,null,null,null,null,null,null,null,"","","","","","",0,0,0,0,0,0]
["Data/Horário",null,null,null,null,null,"Local",null,null,null,null,null,null,null,null,null,null,null,null,null,null,null,"","","","","","",0,0,0,0,0,0]
[{"$f":"jogo!A212","v":"02.08. 17:00"},{"$f":"jogo!B212","v":"Atlético-GO"},null,"x",null,{"$f":"jogo!D212","v":"Grêmio"},{"$f":"jogo!E212","v":"Serra Dourada"},null,null,null,null,null,null,null,null,null,null,null,null,null,null,null,"","","","","","",0,0,0,0,0,0]
[{"$f":"jogo!A213","v":"02.08. 17:00"},{"$f":"jogo!B213","v":"Atlético-MG"},null,"x",null,{"$f":"jogo!D213","v":"Corinthians"},{"$f":"jogo!E213","v":"Independência"},null,null,null,null,null,null,null,null,null,null,null,null,null,null,null,"","","","","","",0,0,0,0,0,0]
[{"$f":"jogo!A214","v":"02.08. 17:00"},{"$f":"jogo!B214","v":"Atlético-PR"},null,"x",null,{"$f":"jogo!D214","v":"Avaí"},{"$f":"jogo!E214","v":"Arena da Baixada"},null,null,null,null,null,null,null,null,null,null,null,null,null,null,null,"","","","","","",0,0,0,0,0,0]
[{"$f":"jogo!A215","v":"02.08. 17:00"},{"$f":"jogo!B215","v":"Botafogo"},null,"x",null,{"$f":"jogo!D215","v":"Palmeiras"},{"$f":"jogo!E215","v":"Nilton Santos"},null,null,null,null,null,null,null,null,null,null,null,null,null,null,null,"","","","","","",0,0,0,0,0,0]
[{"$f":"jogo!A216","v":"02.08. 17:00"},{"$f":"jogo!B216","v":"Chapecoense"},null,"x",null,{"$f":"jogo!D216","v":"Bahia"},{"$f":"jogo!E216","v":"Arena Condá"},null,null,null,null,null,null,null,null,null,null,null,null,null,null,null,"","","","","","",0,0,0,0,0,0]
[{"$f":"jogo!A217","v":"02.08. 17:00"},{"$f":"jogo!B217","v":"Santos"},null,"x",null,{"$f":"jogo!D217","v":"Flamengo"},{"$f":"jogo!E217","v":"Vila Belmiro"},null,null,null,null,null,null,null,null,null,null,null,null,null,null,null,"","","","","","",0,0,0,0,0,0]
[{"$f":"jogo!A218","v":"02.08. 17:00"},{"$f":"jogo!B218","v":"São Paulo"},null,"x",null,{"$f":"jogo!D218","v":"Coritiba"},{"$f":"jogo!E218","v":"Morumbi"},null,null,null,null,null,null,null,null,null,null,null,null,null,null,null,"","","","","","",0,0,0,0,0,0]
[{"$f":"jogo!A219","v":"02.08. 17:00"},{"$f":"jogo!B219","v":"Sport Recife"},null,"x",null,{"$f":"jogo!D219","v":"Fluminense"},{"$f":"jogo!E219","v":"Ilha do Retiro"},null,null,null,null,null,null,null,null,null,null,null,null,null,null,null,"","","","","","",0,0,0,0,0,0]
[{"$f":"jogo!A220","v":"02.08. 17:00"},{"$f":"jogo!B220","v":"Vasco"},null,"x",null,{"$f":"jogo!D220","v":"Cruzeiro"},{"$f":"jogo!E220","v":"São Januário"},null,null,null,null,null,null,null,null,null,null,null,null,null,null,null,"","","","","","",0,0,0,0,0,0]
[{"$f":"jogo!A221","v":"02.08. 17:00"},{"$f":"jogo!B221","v":"Vitória"},null,"x",null,{"$f":"jogo!D221","v":"Ponte Preta"},{"$f":"jogo!E221","v":"Barradão"},null,null,null,null,null,null,null,null,null,null,null,null,null,null,null,"","","","","","",0,0,0,0,0,0]
["19 ª Rodada",null,null,null,null,null,null,null,null,null,null,null,null,null,null,null,null,null,null,null,null,null,"","","","","","",0,0,0,0,0,0]
["Data/Horário",null,null,null,null,null,"Local",null,null,null,null,null,null,null,null,null,null,null,null,null,null,null,"","","","","","",0,0,0,0,0,0]
[{"$f":"jogo!A224","v":"05.08. 17:00"},{"$f":"jogo!B224","v":"Avaí"},null,"x",null,{"$f":"jogo!D224","v":"Santos"},{"$f":"jogo!E224","v":"Ressacada"},null,null,null,null,null,null,null,null,null,null,null,null,null,null,null,"","","","","","",0,0,0,0,0,0]
[{"$f":"jogo!A225","v":"05.08. 17:00"},{"$f":"jogo!B225","v":"Bahia"},null,"x",null,{"$f":"jogo!D225","v":"São Paulo"},{"$f":"jogo!E225","v":"Arena Fonte Nova"},null,null,null,null,null,null,null,null,null,null,null,null,null,null,null,"","","","","","",0,0,0,0,0,0]
[{"$f":"jogo!A226","v":"05.08. 17:00"},{"$f":"jogo!B226","v":"Corinthians"},null,"x",null,{"$f":"jogo!D226","v":"Sport Recife"},{"$f":"jogo!E226","v":"Arena Corinthians"},null,null,null,null,null,null,null,null,null,null,null,null,null,null,null,"","","","","","",0,0,0,0,0,0]
[{"$f":"jogo!A227","v":"05.08. 17:00"},{"$f":"jogo!B227","v":"Coritiba"},null,"x",null,{"$f":"jogo!D227","v":"Chapecoense"},{"$f":"jogo!E227","v":"Couto Pereira"},null,null,null,null,null,null,null,null,null,null,null,null,null,null,null,"","","","","","",0,0,0,0,0,0]
[{"$f":"jogo!A228","v":"05.08. 17:00"},{"$f":"jogo!B228","v":"Cruzeiro"},null,"x",null,{"$f":"jogo!D228","v":"Botafogo"},{"$f":"jogo!E228","v":"Mineirão"},null,null,null,null,null,null,null,null,null,null,null,null,null,null,null,"","","","","","",0,0,0,0,0,0]
[{"$f":"jogo!A229","v":"05.08. 17:00"},{"$f":"jogo!B229","v":"Flamengo"},null,"x",null,{"$f":"jogo!D229","v":"Vitória"},{"$f":"jogo!E229","v":"Maracanã"},null,null,null,null,null,null,null,null,null,null,null,null,null,null,null,"","","","","","",0,0,0,0,0,0]
[{"$f":"jogo!A230","v":"05.08. 17:00"},{"$f":"jogo!B230","v":"Fluminense"},null,"x",null,{"$f":"jogo!D230","v":"Atlético-GO"},{"$f":"jogo!E230","v":"Maracanã"},null,null,null,null,null,null,null,null,null,null,null,null,null,null,null,"","","","","","",0,0,0,0,0,0]
[{"$f":"jogo!A231","v":"05.08. 17:00"},{"$f":"jogo!B231","v":"Grêmio"},null,"x",null,{"$f":"jogo!D231","v":"Atlético-MG"},{"$f":"jogo!E231","v":"Arena do Grêmio"},null,null,null,null,null,null,null,null,null,null,null,null,null,null,null,"","","","","","",0,0,0,0,0,0]
[{"$f":"jogo!A232","v":"05.08. 17:00"},{"$f":"jogo!B232","v":"Palmeiras"},null,"x",null,{"$f":"jogo!D232","v":"Atlético-PR"},{"$f":"jogo!E232","v":"Allianz Parque"},null,null,null,null,null,null,null,null,null,null,null,null,null,null,null,"","","","","","",0,0,0,0,0,0]
[{"$f":"jogo!A233","v":"05.08. 17:00"},{"$f":"jogo!B233","v":"Ponte Preta"},null,"x",null,{"$f":"jogo!D233","v":"Vasco"},{"$f":"jogo!E233","v":"Moisés Lucarelli"},null,null,null,null,null,null,null,null,null,null,null,null,null,null,null,"","","","","","",0,0,0,0,0,0]
["20 ª Rodada",null,null,null,null,null,null,null,null,null,null,null,null,null,null,null,null,null,null,null,null,null,"","","","","","",0,0,0,0,0,0]
["Data/Horário",null,null,null,null,null,"Local",null,null,null,null,null,null,null,null,null,null,null,null,null,null,null,"","","","","","",0,0,0,0,0,0]
[{"$f":"jogo!A236","v":"12.08. 17:00"},{"$f":"jogo!B236","v":"Atlético-GO"},null,"x",null,{"$f":"jogo!D236","v":"Coritiba"},{"$f":"jogo!E236","v":"Serra Dourada"},null,null,null,null,null,null,null,null,null,null,null,null,null,null,null,"","","","","","",0,0,0,0,0,0]
[{"$f":"jogo!A237","v":"12.08. 17:00"},{"$f":"jogo!B237","v":"Atlético-MG"},null,"x",null,{"$f":"jogo!D237","v":"Flamengo"},{"$f":"jogo!E237","v":"Independência"},null,null,null,null,null,null,null,null,null,null,null,null,null,null,null,"","","","","","",0,0,0,0,0,0]
[{"$f":"jogo!A238","v":"12.08. 17:00"},{"$f":"jogo!B238","v":"Atlético-PR"},null,"x",null,{"$f":"jogo!D238","v":"Bahia"},{"$f":"jogo!E238","v":"Arena da Baixada"},null,null,null,null,null,null,null,null,null,null,null,null,null,null,null,"","","","","","",0,0,0,0,0,0]
[{"$f":"jogo!A239","v":"12.08. 17:00"},{"$f":"jogo!B239","v":"Botafogo"},null,"x",null,{"$f":"jogo!D239","v":"Grêmio"},{"$f":"jogo!E239","v":"Nilton Santos"},null,null,null,null,null,null,null,null,null,null,null,null,null,null,null,"","","","","","",0,0,0,0,0,0]
[{"$f":"jogo!A240","v":"12.08. 17:00"},{"$f":"jogo!B240","v":"Chapecoense"},null,"x",null,{"$f":"jogo!D240","v":"Corinthians"},{"$f":"jogo!E240","v":"Arena Condá"},null,null,null,null,null,null,null,null,null,null,null,null,null,null,null,"","","","","","",0,0,0,0,0,0]
[{"$f":"jogo!A241","v":"12.08. 17:00"},{"$f":"jogo!B241","v":"Santos"},null,"x",null,{"$f":"jogo!D241","v":"Fluminense"},{"$f":"jogo!E241","v":"Vila Belmiro"},null,null,null,null,null,null,null,null,null,null,null,null,null,null,null,"","","","","","",0,0,0,0,0,0]
[{"$f":"jogo!A242","v":"12.08. 17:00"},{"$f":"jogo!B242","v":"São Paulo"},null,"x",null,{"$f":"jogo!D242","v":"Cruzeiro"},{"$f":"jogo!E242","v":"Morumbi"},null,null,null,null,null,null,null,null,null,null,null,null,null,null,null,"","","","","","",0,0,0,0,0,0]
[{"$f":"jogo!A243","v":"12.08. 17:00"},{"$f":"jogo!B243","v":"Sport Recife"},null,"x",null,{"$f":"jogo!D243","v":"Ponte Preta"},{"$f":"jogo!E243","v":"Ilha do Retiro"},null,null,null,null,null,null,null,null,null,null,null,null,null,null,null,"","","","","","",0,0,0,0,0,0]
[{"$f":"jogo!A244","v":"12.08. 17:00"},{"$f":"jogo!B244","v":"Vasco"},null,"x",null,{"$f":"jogo!D244","v":"Palmeiras"},{"$f":"jogo!E244","v":"São Januário"},null,null,null,null,null,null,null,null,null,null,null,null,null,null,null,"","","","","","",0,0,0,0,0,0]
[{"$f":"jogo!A245","v":"12.08. 17:00"},{"$f":"jogo!B245","v":"Vitória"},null,"x",null,{"$f":"jogo!D245","v":"Avaí"},{"$f":"jogo!E245","v":"Barradão"},null,null,null,null,null,null,null,null,null,null,null,null,null,null,null,"","","","","","",0,0,0,0,0,0]
["21 ª Rodada",null,null,null,null,null,null,null,null,null,null,null,null,null,null,null,null,null,null,null,null,null,"","","","","","",0,0,0,0,0,0]
["Data/Horário",null,null,null,null,null,"Local",null,null,null,null,null,null,null,null,null,null,null,null,null,null,null,"","","","","","",0,0,0,0,0,0]
[{"$f":"jogo!A248","v":"19.08. 17:00"},{"$f":"jogo!B248","v":"Avaí"},null,"x",null,{"$f":"jogo!D248","v":"São Paulo"},{"$f":"jogo!E248","v":"Ressacada"},null,null,null,null,null,null,null,null,null,null,null,null,null,null,null,"","","","","","",0,0,0,0,0,0]
[{"$f":"jogo!A249","v":"19.08. 17:00"},{"$f":"jogo!B249","v":"Bahia"},null,"x",null,{"$f":"jogo!D249","v":"Vasco"},{"$f":"jogo!E249","v":"Arena Fonte Nova"},null,null,null,null,null,null,null,null,null,null,null,null,null,null,null,"","","","","","",0,0,0,0,0,0]
[{"$f":"jogo!A250","v":"19.08. 17:00"},{"$f":"jogo!B250","v":"Corinthians"},null,"x",null,{"$f":"jogo!D250","v":"Vitória"},{"$f":"jogo!E250","v":"Arena Corinthians"},null,null,null,null,null,null,null,null,null,null,null,null,null,null,null,"","","","","","",0,0,0,0,0,0]
[{"$f":"jogo!A251","v":"19.08. 17:00"},{"$f":"jogo!B251","v":"Coritiba"},null,"x",null,{"$f":"jogo!D251","v":"Santos"},{"$f":"jogo!E251","v":"Couto Pereira"},null,null,null,null,null,null,null,null,null,null,null,null,null,null,null,"","","","","","",0,0,0,0,0,0]
[{"$f":"jogo!A252","v":"19.08. 17:00"},{"$f":"jogo!B252","v":"Cruzeiro"},null,"x",null,{"$f":"jogo!D252","v":"Sport Recife"},{"$f":"jogo!E252","v":"Mineirão"},null,null,null,null,null,null,null,null,null,null,null,null,null,null,null,"","","","","","",0,0,0,0,0,0]
[{"$f":"jogo!A253","v":"19.08. 17:00"},{"$f":"jogo!B253","v":"Flamengo"},null,"x",null,{"$f":"jogo!D253","v":"Atlético-GO"},{"$f":"jogo!E253","v":"Maracanã"},null,null,null,null,null,null,null,null,null,null,null,null,null,null,null,"","","","","","",0,0,0,0,0,0]
[{"$f":"jogo!A254","v":"19.08. 17:00"},{"$f":"jogo!B254","v":"Fluminense"},null,"x",null,{"$f":"jogo!D254","v":"Atlético-MG"},{"$f":"jogo!E254","v":"Maracanã"},null,null,null,null,null,null,null,null,null,null,null,null,null,null,null,"","","","","","",0,0,0,0,0,0]
[{"$f":"jogo!A255","v":"19.08. 17:00"},{"$f":"jogo!B255","v":"Grêmio"},null,"x",null,{"$f":"jogo!D255","v":"Atlético-PR"},{"$f":"jogo!E255","v":"Arena do Grêmio"},null,null,null,null,null,null,null,null,null,null,null,null,null,null,null,"","","","","","",0,0,0,0,0,0]
[{"$f":"jogo!A256","v":"19.08. 17:00"},{"$f":"jogo!B256","v":"Palmeiras"},null,"x",null,{"$f":"jogo!D256","v":"Chapecoense"},{"$f":"jogo!E256","v":"Allianz Parque"},null,null,null,null,null,null,null,null,null,null,null,null,null,null,null,"","","","","","",0,0,0,0,0,0]
[{"$f":"jogo!A257","v":"19.08. 17:00"},{"$f":"jogo!B257","v":"Ponte Preta"},null,"x",null,{"$f":"jogo!D257","v":"Botafogo"},{"$f":"jogo!E257","v":"Moisés Lucarelli"},null,null,null,null,null,null,null,null,null,null,null,null,null,null,null,"","","","","","",0,0,0,0,0,0]
["22 ª Rodada",null,null,null,null,null,null,null,null,null,null,null,null,null,null,null,null,null,null,null,null,null,"","","","","","",0,0,0,0,0,0]
["Data/Horário",null,null,null,null,null,"Local",null,null,null,null,null,null,null,null,null,null,null,null,null,null,null,"","","","","","",0,0,0,0,0,0]
[{"$f":"jogo!A260","v":"26.08. 17:00"},{"$f":"jogo!B260","v":"Avaí"},null,"x",null,{"$f":"jogo!D260","v":"Chapecoense"},{"$f":"jogo!E260","v":"Ressacada"},null,null,null,null,null,null,null,null,null,null,null,null,null,null,null,"","","","","","",0,0,0,0,0,0]
[{"$f":"jogo!A261","v":"26.08. 17:00"},{"$f":"jogo!B261","v":"Bahia"},null,"x",null,{"$f":"jogo!D261","v":"Botafogo"},{"$f":"jogo!E261","v":"Arena Fonte Nova"},null,null,null,null,null,null,null,null,null,null,null,null,null,null,null,"","","","","","",0,0,0,0,0,0]
[{"$f":"jogo!A262","v":"26.08. 17:00"},{"$f":"jogo!B262","v":"Corinthians"},null,"x",null,{"$f":"jogo!D262","v":"Atlético-GO"},{"$f":"jogo!E262","v":"Arena Corinthians"},null,null,null,null,null,null,null,null,null,null,null,null,null,null,null,{"$f":"IF(C262&E262=\"\",\"\",IF(C262=E262,1,IF(C262>E262,3,IF(C262<E262,0))))","v":""},{"$f":"IF(C262&E262=\"\",\"\",IF(E262=C262,1,IF(C262<E262,3,IF(C262>E262,0))))","v":""},{"$f":"IF(C262&E262=\"\",\"\",IF(C262&E262<>\"\",1))","v":""},{"$f":"IF(C262&E262=\"\",\"\",IF(C262&E262<>\"\",1))","v":""},{"$f":"IF(C262=\"\",\"\",C262)","v":""},{"$f":"IF(E262=\"\",\"\",E262)","v":""},0,0,0,0,0,0]
[{"$f":"jogo!A263","v":"26.08. 17:00"},{"$f":"jogo!B263","v":"Coritiba"},null,"x",null,{"$f":"jogo!D263","v":"Vitória"},{"$f":"jogo!E263","v":"Couto Pereira"},null,null,null,null,null,null,null,null,null,null,null,null,null,null,null,"","","","","","",{"$f":"IF(W263=3,1,0)","v":0},{"$f":"IF(X263=3,1,0)","v":0},{"$f":"IF(W263=1,1,0)","v":0},{"$f":"IF(X263=1,1,0)","v":0},{"$f":"IF(W263=0,1,0)","v":0},{"$f":"IF(X263=0,1,0)","v":0}]
[{"$f":"jogo!A264","v":"26.08. 17:00"},{"$f":"jogo!B264","v":"Cruzeiro"},null,"x",null,{"$f":"jogo!D264","v":"Santos"},{"$f":"jogo!E264","v":"Mineirão"},null,null,null,null,null,null,null,null,null,null,null,null,null,null,null,"","","","","","",0,0,0,0,0,0]
[{"$f":"jogo!A265","v":"26.08. 17:00"},{"$f":"jogo!B265","v":"Flamengo"},null,"x",null,{"$f":"jogo!D265","v":"Atlético-PR"},{"$f":"jogo!E265","v":"Maracanã"},null,null,null,null,null,null,null,null,null,null,null,null,null,null,null,"","","","","","",0,0,0,0,0,0]
[{"$f":"jogo!A266","v":"26.08. 17:00"},{"$f":"jogo!B266","v":"Fluminense"},null,"x",null,{"$f":"jogo!D266","v":"Vasco"},{"$f":"jogo!E266","v":"Maracanã"},null,null,null,null,null,null,null,null,null,null,null,null,null,null,null,"","","","","","",0,0,0,0,0,0]
[{"$f":"jogo!A267","v":"26.08. 17:00"},{"$f":"jogo!B267","v":"Grêmio"},null,"x",null,{"$f":"jogo!D267","v":"Sport Recife"},{"$f":"jogo!E267","v":"Arena do Grêmio"},null,null,null,null,null,null,null,null,null,null,null,null,null,null,null,"","","","","","",0,0,0,0,0,0]
[{"$f":"jogo!A268","v":"26.08. 17:00"},{"$f":"jogo!B268","v":"Palmeiras"},null,"x",null,{"$f":"jogo!D268","v":"São Paulo"},{"$f":"jogo!E268","v":"Allianz Parque"},null,null,null,null,null,null,null,null,null,null,null,null,null,null,null,"","","","","","",0,0,0,0,0,0]
[{"$f":"jogo!A269","v":"26.08. 17:00"},{"$f":"jogo!B269","v":"Ponte Preta"},null,"x",null,{"$f":"jogo!D269","v":"Atlético-MG"},{"$f":"jogo!E269","v":"Moisés Lucarelli"},null,null,null,null,null,null,null,null,null,null,null,null,null,null,null,"","","","","","",0,0,0,0,0,0]
["23 ª Rodada",null,null,null,null,null,null,null,null,null,null,null,null,null,null,null,null,null,null,null,null,null,"","","","","","",0,0,0,0,0,0]
["Data/Horário",null,null,null,null,null,"Local",null,null,null,null,null,null,null,null,null,null,null,null,null,null,null,"","","","","","",0,0,0,0,0,0]
[{"$f":"jogo!A272","v":"09.09. 17:00"},{"$f":"jogo!B272","v":"Atlético-GO"},null,"x",null,{"$f":"jogo!D272","v":"Bahia"},{"$f":"jogo!E272","v":"Serra Dourada"},null,null,null,null,null,null,null,null,null,null,null,null,null,null,null,"","","","","","",0,0,0,0,0,0]
[{"$f":"jogo!A273","v":"09.09. 17:00"},{"$f":"jogo!B273","v":"Atlético-MG"},null,"x",null,{"$f":"jogo!D273","v":"Palmeiras"},{"$f":"jogo!E273","v":"Independência"},null,null,null,null,null,null,null,null,null,null,null,null,null,null,null,"","","","","","",0,0,0,0,0,0]
[{"$f":"jogo!A274","v":"09.09. 17:00"},{"$f":"jogo!B274","v":"Atlético-PR"},null,"x",null,{"$f":"jogo!D274","v":"Coritiba"},{"$f":"jogo!E274","v":"Arena da Baixada"},null,null,null,null,null,null,null,null,null,null,null,null,null,null,null,"","","","","","",0,0,0,0,0,0]
[{"$f":"jogo!A275","v":"09.09. 17:00"},{"$f":"jogo!B275","v":"Botafogo"},null,"x",null,{"$f":"jogo!D275","v":"Flamengo"},{"$f":"jogo!E275","v":"Nilton Santos"},null,null,null,null,null,null,null,null,null,null,null,null,null,null,null,"","","","","","",0,0,0,0,0,0]
[{"$f":"jogo!A276","v":"09.09. 17:00"},{"$f":"jogo!B276","v":"Chapecoense"},null,"x",null,{"$f":"jogo!D276","v":"Cruzeiro"},{"$f":"jogo!E276","v":"Arena Condá"},null,null,null,null,null,null,null,null,null,null,null,null,null,null,null,"","","","","","",0,0,0,0,0,0]
[{"$f":"jogo!A277","v":"09.09. 17:00"},{"$f":"jogo!B277","v":"Santos"},null,"x",null,{"$f":"jogo!D277","v":"Corinthians"},{"$f":"jogo!E277","v":"Vila Belmiro"},null,null,null,null,null,null,null,null,null,null,null,null,null,null,null,"","","","","","",0,0,0,0,0,0]
[{"$f":"jogo!A278","v":"09.09. 17:00"},{"$f":"jogo!B278","v":"São Paulo"},null,"x",null,{"$f":"jogo!D278","v":"Ponte Preta"},{"$f":"jogo!E278","v":"Morumbi"},null,null,null,null,null,null,null,null,null,null,null,null,null,null,null,"","","","","","",0,0,0,0,0,0]
[{"$f":"jogo!A279","v":"09.09. 17:00"},{"$f":"jogo!B279","v":"Sport Recife"},null,"x",null,{"$f":"jogo!D279","v":"Avaí"},{"$f":"jogo!E279","v":"Ilha do Retiro"},null,null,null,null,null,null,null,null,null,null,null,null,null,null,null,"","","","","","",0,0,0,0,0,0]
[{"$f":"jogo!A280","v":"09.09. 17:00"},{"$f":"jogo!B280","v":"Vasco"},null,"x",null,{"$f":"jogo!D280","v":"Grêmio"},{"$f":"jogo!E280","v":"São Januário"},null,null,null,null,null,null,null,null,null,null,null,null,null,null,null,"","","","","","",0,0,0,0,0,0]
[{"$f":"jogo!A281","v":"09.09. 17:00"},{"$f":"jogo!B281","v":"Vitória"},null,"x",null,{"$f":"jogo!D281","v":"Fluminense"},{"$f":"jogo!E281","v":"Barradão"},null,null,null,null,null,null,null,null,null,null,null,null,null,null,null,"","","","","","",0,0,0,0,0,0]
["24 ª Rodada",null,null,null,null,null,null,null,null,null,null,null,null,null,null,null,null,null,null,null,null,null,"","","","","","",0,0,0,0,0,0]
["Data/Horário",null,null,null,null,null,"Local",null,null,null,null,null,null,null,null,null,null,null,null,null,null,null,"","","","","","",0,0,0,0,0,0]
[{"$f":"jogo!A284","v":"16.09. 17:00"},{"$f":"jogo!B284","v":"Atlético-PR"},null,"x",null,{"$f":"jogo!D284","v":"Fluminense"},{"$f":"jogo!E284","v":"Arena da Baixada"},null,null,null,null,null,null,null,null,null,null,null,null,null,null,null,"","","","","","",0,0,0,0,0,0]
[{"$f":"jogo!A285","v":"16.09. 17:00"},{"$f":"jogo!B285","v":"Avaí"},null,"x",null,{"$f":"jogo!D285","v":"Atlético-MG"},{"$f":"jogo!E285","v":"Ressacada"},null,null,null,null,null,null,null,null,null,null,null,null,null,null,null,"","","","","","",0,0,0,0,0,0]
[{"$f":"jogo!A286","v":"16.09. 17:00"},{"$f":"jogo!B286","v":"Botafogo"},null,"x",null,{"$f":"jogo!D286","v":"Santos"},{"$f":"jogo!E286","v":"Nilton Santos"},null,null,null,null,null,null,null,null,null,null,null,null,null,null,null,"","","","","","",0,0,0,0,0,0]
[{"$f":"jogo!A287","v":"16.09. 17:00"},{"$f":"jogo!B287","v":"Corinthians"},null,"x",null,{"$f":"jogo!D287","v":"Vasco"},{"$f":"jogo!E287","v":"Arena Corinthians"},null,null,null,null,null,null,null,null,null,null,null,null,null,null,null,"","","","","","",0,0,0,0,0,0]
[{"$f":"jogo!A288","v":"16.09. 17:00"},{"$f":"jogo!B288","v":"Cruzeiro"},null,"x",null,{"$f":"jogo!D288","v":"Bahia"},{"$f":"jogo!E288","v":"Mineirão"},null,null,null,null,null,null,null,null,null,null,null,null,null,null,null,"","","","","","",0,0,0,0,0,0]
[{"$f":"jogo!A289","v":"16.09. 17:00"},{"$f":"jogo!B289","v":"Flamengo"},null,"x",null,{"$f":"jogo!D289","v":"Sport Recife"},{"$f":"jogo!E289","v":"Maracanã"},null,null,null,null,null,null,null,null,null,null,null,null,null,null,null,"","","","","","",0,0,0,0,0,0]
[{"$f":"jogo!A290","v":"16.09. 17:00"},{"$f":"jogo!B290","v":"Grêmio"},null,"x",null,{"$f":"jogo!D290","v":"Chapecoense"},{"$f":"jogo!E290","v":"Arena do Grêmio"},null,null,null,null,null,null,null,null,null,null,null,null,null,null,null,"","","","","","",0,0,0,0,0,0]
[{"$f":"jogo!A291","v":"16.09. 17:00"},{"$f":"jogo!B291","v":"Palmeiras"},null,"x",null,{"$f":"jogo!D291","v":"Coritiba"},{"$f":"jogo!E291","v":"Allianz Parque"},null,null,null,null,null,null,null,null,null,null,null,null,null,null,null,"","","","","","",0,0,0,0,0,0]
[{"$f":"jogo!A292","v":"16.09. 17:00"},{"$f":"jogo!B292","v":"Ponte Preta"},null,"x",null,{"$f":"jogo!D292","v":"Atlético-GO"},{"$f":"jogo!E292","v":"Moisés Lucarelli"},null,null,null,null,null,null,null,null,null,null,null,null,null,null,null,"","","","","","",0,0,0,0,0,0]
[{"$f":"jogo!A293","v":"16.09. 17:00"},{"$f":"jogo!B293","v":"Vitória"},null,"x",null,{"$f":"jogo!D293","v":"São Paulo"},{"$f":"jogo!E293","v":"Barradão"},null,null,null,null,null,null,null,null,null,null,null,null,null,null,null,"","","","","","",0,0,0,0,0,0]
["25 ª Rodada",null,null,null,null,null,null,null,null,null,null,null,null,null,null,null,null,null,null,null,null,null,"","","","","","",0,0,0,0,0,0]
["Data/Horário",null,null,null,null,null,"Local",null,null,null,null,null,null,null,null,null,null,null,null,null,null,null,"","","","","","",0,0,0,0,0,0]
[{"$f":"jogo!A296","v":"23.09. 17:00"},{"$f":"jogo!B296","v":"Atlético-GO"},null,"x",null,{"$f":"jogo!D296","v":"Cruzeiro"},{"$f":"jogo!E296","v":"Serra Dourada"},null,null,null,null,null,null,null,null,null,null,null,null,null,null,null,"","","","","","",0,0,0,0,0,0]
[{"$f":"jogo!A297","v":"23.09. 17:00"},{"$f":"jogo!B297","v":"Atlético-MG"},null,"x",null,{"$f":"jogo!D297","v":"Vitória"},{"$f":"jogo!E297","v":"Independência"},null,null,null,null,null,null,null,null,null,null,null,null,null,null,null,"","","","","","",0,0,0,0,0,0]
[{"$f":"jogo!A298","v":"23.09. 17:00"},{"$f":"jogo!B298","v":"Bahia"},null,"x",null,{"$f":"jogo!D298","v":"Grêmio"},{"$f":"jogo!E298","v":"Arena Fonte Nova"},null,null,null,null,null,null,null,null,null,null,null,null,null,null,null,"","","","","","",0,0,0,0,0,0]
[{"$f":"jogo!A299","v":"23.09. 17:00"},{"$f":"jogo!B299","v":"Chapecoense"},null,"x",null,{"$f":"jogo!D299","v":"Ponte Preta"},{"$f":"jogo!E299","v":"Arena Condá"},null,null,null,null,null,null,null,null,null,null,null,null,null,null,null,"","","","","","",0,0,0,0,0,0]
[{"$f":"jogo!A300","v":"23.09. 17:00"},{"$f":"jogo!B300","v":"Coritiba"},null,"x",null,{"$f":"jogo!D300","v":"Botafogo"},{"$f":"jogo!E300","v":"Couto Pereira"},null,null,null,null,null,null,null,null,null,null,null,null,null,null,null,"","","","","","",0,0,0,0,0,0]
[{"$f":"jogo!A301","v":"23.09. 17:00"},{"$f":"jogo!B301","v":"Flamengo"},null,"x",null,{"$f":"jogo!D301","v":"Avaí"},{"$f":"jogo!E301","v":"Maracanã"},null,null,null,null,null,null,null,null,null,null,null,null,null,null,null,"","","","","","",0,0,0,0,0,0]
[{"$f":"jogo!A302","v":"23.09. 17:00"},{"$f":"jogo!B302","v":"Fluminense"},null,"x",null,{"$f":"jogo!D302","v":"Palmeiras"},{"$f":"jogo!E302","v":"Maracanã"},null,null,null,null,null,null,null,null,null,null,null,null,null,null,null,"","","","","","",0,0,0,0,0,0]
[{"$f":"jogo!A303","v":"23.09. 17:00"},{"$f":"jogo!B303","v":"Santos"},null,"x",null,{"$f":"jogo!D303","v":"Atlético-PR"},{"$f":"jogo!E303","v":"Vila Belmiro"},null,null,null,null,null,null,null,null,null,null,null,null,null,null,null,"","","","","","",0,0,0,0,0,0]
[{"$f":"jogo!A304","v":"23.09. 17:00"},{"$f":"jogo!B304","v":"São Paulo"},null,"x",null,{"$f":"jogo!D304","v":"Corinthians"},{"$f":"jogo!E304","v":"Morumbi"},null,null,null,null,null,null,null,null,null,null,null,null,null,null,null,"","","","","","",0,0,0,0,0,0]
[{"$f":"jogo!A305","v":"23.09. 17:00"},{"$f":"jogo!B305","v":"Sport Recife"},null,"x",null,{"$f":"jogo!D305","v":"Vasco"},{"$f":"jogo!E305","v":"Ilha do Retiro"},null,null,null,null,null,null,null,null,null,null,null,null,null,null,null,"","","","","","",0,0,0,0,0,0]
["26 ª Rodada",null,null,null,null,null,null,null,null,null,null,null,null,null,null,null,null,null,null,null,null,null,"","","","","","",0,0,0,0,0,0]
["Data/Horário",null,null,null,null,null,"Local",null,null,null,null,null,null,null,null,null,null,null,null,null,null,null,"","","","","","",0,0,0,0,0,0]
[{"$f":"jogo!A308","v":"27.09. 17:00"},{"$f":"jogo!B308","v":"Atlético-PR"},null,"x",null,{"$f":"jogo!D308","v":"Atlético-MG"},{"$f":"jogo!E308","v":"Arena da Baixada"},null,null,null,null,null,null,null,null,null,null,null,null,null,null,null,"","","","","","",0,0,0,0,0,0]
[{"$f":"jogo!A309","v":"27.09. 17:00"},{"$f":"jogo!B309","v":"Avaí"},null,"x",null,{"$f":"jogo!D309","v":"Atlético-GO"},{"$f":"jogo!E309","v":"Ressacada"},null,null,null,null,null,null,null,null,null,null,null,null,null,null,null,"","","","","","",0,0,0,0,0,0]
[{"$f":"jogo!A310","v":"27.09. 17:00"},{"$f":"jogo!B310","v":"Bahia"},null,"x",null,{"$f":"jogo!D310","v":"Coritiba"},{"$f":"jogo!E310","v":"Arena Fonte Nova"},null,null,null,null,null,null,null,null,null,null,null,null,null,null,null,"","","","","","",0,0,0,0,0,0]
[{"$f":"jogo!A311","v":"27.09. 17:00"},{"$f":"jogo!B311","v":"Botafogo"},null,"x",null,{"$f":"jogo!D311","v":"Vitória"},{"$f":"jogo!E311","v":"Nilton Santos"},null,null,null,null,null,null,null,null,null,null,null,null,null,null,null,"","","","","","",0,0,0,0,0,0]
[{"$f":"jogo!A312","v":"27.09. 17:00"},{"$f":"jogo!B312","v":"Cruzeiro"},null,"x",null,{"$f":"jogo!D312","v":"Corinthians"},{"$f":"jogo!E312","v":"Mineirão"},null,null,null,null,null,null,null,null,null,null,null,null,null,null,null,"","","","","","",0,0,0,0,0,0]
[{"$f":"jogo!A313","v":"27.09. 17:00"},{"$f":"jogo!B313","v":"Grêmio"},null,"x",null,{"$f":"jogo!D313","v":"Fluminense"},{"$f":"jogo!E313","v":"Arena do Grêmio"},null,null,null,null,null,null,null,null,null,null,null,null,null,null,null,"","","","","","",0,0,0,0,0,0]
[{"$f":"jogo!A314","v":"27.09. 17:00"},{"$f":"jogo!B314","v":"Palmeiras"},null,"x",null,{"$f":"jogo!D314","v":"Santos"},{"$f":"jogo!E314","v":"Allianz Parque"},null,null,null,null,null,null,null,null,null,null,null,null,null,null,null,"","","","","","",0,0,0,0,0,0]
[{"$f":"jogo!A315","v":"27.09. 17:00"},{"$f":"jogo!B315","v":"Ponte Preta"},null,"x",null,{"$f":"jogo!D315","v":"Flamengo"},{"$f":"jogo!E315","v":"Moisés Lucarelli"},null,null,null,null,null,null,null,null,null,null,null,null,null,null,null,"","","","","","",0,0,0,0,0,0]
[{"$f":"jogo!A316","v":"27.09. 17:00"},{"$f":"jogo!B316","v":"São Paulo"},null,"x",null,{"$f":"jogo!D316","v":"Sport Recife"},{"$f":"jogo!E316","v":"Morumbi"},null,null,null,null,null,null,null,null,null,null,null,null,null,null,null,"","","","","","",0,0,0,0,0,0]
[{"$f":"jogo!A317","v":"27.09. 17:00"},{"$f":"jogo!B317","v":"Vasco"},null,"x",null,{"$f":"jogo!D317","v":"Chapecoense"},{"$f":"jogo!E317","v":"São Januário"},null,null,null,null,null,null,null,null,null,null,null,null,null,null,null,"","","","","","",0,0,0,0,0,0]
["27 ª Rodada",null,null,null,null,null,null,null,null,null,null,null,null,null,null,null,null,null,null,null,null,null,"","","","","","",0,0,0,0,0,0]
["Data/Horário",null,null,null,null,null,"Local",null,null,null,null,null,null,null,null,null,null,null,null,null,null,null,"","","","","","",0,0,0,0,0,0]
[{"$f":"jogo!A320","v":"30.09. 17:00"},{"$f":"jogo!B320","v":"Atlético-MG"},null,"x",null,{"$f":"jogo!D320","v":"São Paulo"},{"$f":"jogo!E320","v":"Independência"},null,null,null,null,null,null,null,null,null,null,null,null,null,null,null,"","","","","","",0,0,0,0,0,0]
[{"$f":"jogo!A321","v":"30.09. 17:00"},{"$f":"jogo!B321","v":"Atlético-PR"},null,"x",null,{"$f":"jogo!D321","v":"Atlético-GO"},{"$f":"jogo!E321","v":"Arena da Baixada"},null,null,null,null,null,null,null,null,null,null,null,null,null,null,null,"","","","","","",0,0,0,0,0,0]
[{"$f":"jogo!A322","v":"30.09. 17:00"},{"$f":"jogo!B322","v":"Avaí"},null,"x",null,{"$f":"jogo!D322","v":"Vasco"},{"$f":"jogo!E322","v":"Ressacada"},null,null,null,null,null,null,null,null,null,null,null,null,null,null,null,"","","","","","",0,0,0,0,0,0]
[{"$f":"jogo!A323","v":"30.09. 17:00"},{"$f":"jogo!B323","v":"Botafogo"},null,"x",null,{"$f":"jogo!D323","v":"Chapecoense"},{"$f":"jogo!E323","v":"Nilton Santos"},null,null,null,null,null,null,null,null,null,null,null,null,null,null,null,"","","","","","",0,0,0,0,0,0]
[{"$f":"jogo!A324","v":"30.09. 17:00"},{"$f":"jogo!B324","v":"Corinthians"},null,"x",null,{"$f":"jogo!D324","v":"Coritiba"},{"$f":"jogo!E324","v":"Arena Corinthians"},null,null,null,null,null,null,null,null,null,null,null,null,null,null,null,"","","","","","",0,0,0,0,0,0]
[{"$f":"jogo!A325","v":"30.09. 17:00"},{"$f":"jogo!B325","v":"Flamengo"},null,"x",null,{"$f":"jogo!D325","v":"Fluminense"},{"$f":"jogo!E325","v":"Maracanã"},null,null,null,null,null,null,null,null,null,null,null,null,null,null,null,"","","","","","",0,0,0,0,0,0]
[{"$f":"jogo!A326","v":"30.09. 17:00"},{"$f":"jogo!B326","v":"Grêmio"},null,"x",null,{"$f":"jogo!D326","v":"Cruzeiro"},{"$f":"jogo!E326","v":"Arena do Grêmio"},null,null,null,null,null,null,null,null,null,null,null,null,null,null,null,{"$f":"IF(C326&E326=\"\",\"\",IF(C326=E326,1,IF(C326>E326,3,IF(C326<E326,0))))","v":""},{"$f":"IF(C326&E326=\"\",\"\",IF(E326=C326,1,IF(C326<E326,3,IF(C326>E326,0))))","v":""},{"$f":"IF(C326&E326=\"\",\"\",IF(C326&E326<>\"\",1))","v":""},{"$f":"IF(C326&E326=\"\",\"\",IF(C326&E326<>\"\",1))","v":""},{"$f":"IF(C326=\"\",\"\",C326)","v":""},{"$f":"IF(E326=\"\",\"\",E326)","v":""},0,0,0,0,0,0]
[{"$f":"jogo!A327","v":"30.09. 17:00"},{"$f":"jogo!B327","v":"Palmeiras"},null,"x",null,{"$f":"jogo!D327","v":"Bahia"},{"$f":"jogo!E327","v":"Allianz Parque"},null,null,null,null,null,null,null,null,null,null,null,null,null,null,null,"","","","","","",{"$f":"IF(W327=3,1,0)","v":0},{"$f":"IF(X327=3,1,0)","v":0},{"$f":"IF(W327=1,1,0)","v":0},{"$f":"IF(X327=1,1,0)","v":0},{"$f":"IF(W327=0,1,0)","v":0},{"$f":"IF(X327=0,1,0)","v":0}]
[{"$f":"jogo!A328","v":"30.09. 17:00"},{"$f":"jogo!B328","v":"Ponte Preta"},null,"x",null,{"$f":"jogo!D328","v":"Santos"},{"$f":"jogo!E328","v":"Moisés Lucarelli"},null,null,null,null,null,null,null,null,null,null,null,null,null,null,null,"","","","","","",0,0,0,0,0,0]
[{"$f":"jogo!A329","v":"30.09. 17:00"},{"$f":"jogo!B329","v":"Vitória"},null,"x",null,{"$f":"jogo!D329","v":"Sport Recife"},{"$f":"jogo!E329","v":"Barradão"},null,null,null,null,null,null,null,null,null,null,null,null,null,null,null,"","","","","","",0,0,0,0,0,0]
["28 ª Rodada",null,null,null,null,null,null,null,null,null,null,null,null,null,null,null,null,null,null,null,null,null,"","","","","","",0,0,0,0,0,0]
["Data/Horário",null,null,null,null,null,"Local",null,null,null,null,null,null,null,null,null,null,null,null,null,null,null,"","","","","","",0,0,0,0,0,0]
[{"$f":"jogo!A332","v":"14.10. 17:00"},{"$f":"jogo!B332","v":"Atlético-GO"},null,"x",null,{"$f":"jogo!D332","v":"Palmeiras"},{"$f":"jogo!E332","v":"Serra Dourada"},null,null,null,null,null,null,null,null,null,null,null,null,null,null,null,"","","","","","",0,0,0,0,0,0]
[{"$f":"jogo!A333","v":"14.10. 17:00"},{"$f":"jogo!B333","v":"Bahia"},null,"x",null,{"$f":"jogo!D333","v":"Corinthians"},{"$f":"jogo!E333","v":"Arena Fonte Nova"},null,null,null,null,null,null,null,null,null,null,null,null,null,null,null,"","","","","","",0,0,0,0,0,0]
[{"$f":"jogo!A334","v":"14.10. 17:00"},{"$f":"jogo!B334","v":"Chapecoense"},null,"x",null,{"$f":"jogo!D334","v":"Flamengo"},{"$f":"jogo!E334","v":"Arena Condá"},null,null,null,null,null,null,null,null,null,null,null,null,null,null,null,"","","","","","",0,0,0,0,0,0]
[{"$f":"jogo!A335","v":"14.10. 17:00"},{"$f":"jogo!B335","v":"Coritiba"},null,"x",null,{"$f":"jogo!D335","v":"Grêmio"},{"$f":"jogo!E335","v":"Couto Pereira"},null,null,null,null,null,null,null,null,null,null,null,null,null,null,null,"","","","","","",0,0,0,0,0,0]
[{"$f":"jogo!A336","v":"14.10. 17:00"},{"$f":"jogo!B336","v":"Cruzeiro"},null,"x",null,{"$f":"jogo!D336","v":"Ponte Preta"},{"$f":"jogo!E336","v":"Mineirão"},null,null,null,null,null,null,null,null,null,null,null,null,null,null,null,"","","","","","",0,0,0,0,0,0]
[{"$f":"jogo!A337","v":"14.10. 17:00"},{"$f":"jogo!B337","v":"Fluminense"},null,"x",null,{"$f":"jogo!D337","v":"Avaí"},{"$f":"jogo!E337","v":"Maracanã"},null,null,null,null,null,null,null,null,null,null,null,null,null,null,null,"","","","","","",0,0,0,0,0,0]
[{"$f":"jogo!A338","v":"14.10. 17:00"},{"$f":"jogo!B338","v":"Santos"},null,"x",null,{"$f":"jogo!D338","v":"Vitória"},{"$f":"jogo!E338","v":"Vila Belmiro"},null,null,null,null,null,null,null,null,null,null,null,null,null,null,null,"","","","","","",0,0,0,0,0,0]
[{"$f":"jogo!A339","v":"14.10. 17:00"},{"$f":"jogo!B339","v":"São Paulo"},null,"x",null,{"$f":"jogo!D339","v":"Atlético-PR"},{"$f":"jogo!E339","v":"Morumbi"},null,null,null,null,null,null,null,null,null,null,null,null,null,null,null,"","","","","","",0,0,0,0,0,0]
[{"$f":"jogo!A340","v":"14.10. 17:00"},{"$f":"jogo!B340","v":"Sport Recife"},null,"x",null,{"$f":"jogo!D340","v":"Atlético-MG"},{"$f":"jogo!E340","v":"Ilha do Retiro"},null,null,null,null,null,null,null,null,null,null,null,null,null,null,null,"","","","","","",0,0,0,0,0,0]
[{"$f":"jogo!A341","v":"14.10. 17:00"},{"$f":"jogo!B341","v":"Vasco"},null,"x",null,{"$f":"jogo!D341","v":"Botafogo"},{"$f":"jogo!E341","v":"São Januário"},null,null,null,null,null,null,null,null,null,null,null,null,null,null,null,"","","","","","",0,0,0,0,0,0]
["29 ª Rodada",null,null,null,null,null,null,null,null,null,null,null,null,null,null,null,null,null,null,null,null,null,"","","","","","",0,0,0,0,0,0]
["Data/Horário",null,null,null,null,null,"Local",null,null,null,null,null,null,null,null,null,null,null,null,null,null,null,"","","","","","",0,0,0,0,0,0]
[{"$f":"jogo!A344","v":"18.10. 18:00"},{"$f":"jogo!B344","v":"Atlético-GO"},null,"x",null,{"$f":"jogo!D344","v":"Vasco"},{"$f":"jogo!E344","v":"Serra Dourada"},null,null,null,null,null,null,null,null,null,null,null,null,null,null,null,"","","","","","",0,0,0,0,0,0]
[{"$f":"jogo!A345","v":"18.10. 18:00"},{"$f":"jogo!B345","v":"Atlético-MG"},null,"x",null,{"$f":"jogo!D345","v":"Chapecoense"},{"$f":"jogo!E345","v":"Independência"},null,null,null,null,null,null,null,null,null,null,null,null,null,null,null,"","","","","","",0,0,0,0,0,0]
[{"$f":"jogo!A346","v":"18.10. 18:00"},{"$f":"jogo!B346","v":"Avaí"},null,"x",null,{"$f":"jogo!D346","v":"Botafogo"},{"$f":"jogo!E346","v":"Ressacada"},null,null,null,null,null,null,null,null,null,null,null,null,null,null,null,"","","","","","",0,0,0,0,0,0]
[{"$f":"jogo!A347","v":"18.10. 18:00"},{"$f":"jogo!B347","v":"Corinthians"},null,"x",null,{"$f":"jogo!D347","v":"Grêmio"},{"$f":"jogo!E347","v":"Arena Corinthians"},null,null,null,null,null,null,null,null,null,null,null,null,null,null,null,"","","","","","",0,0,0,0,0,0]
[{"$f":"jogo!A348","v":"18.10. 18:00"},{"$f":"jogo!B348","v":"Coritiba"},null,"x",null,{"$f":"jogo!D348","v":"Cruzeiro"},{"$f":"jogo!E348","v":"Couto Pereira"},null,null,null,null,null,null,null,null,null,null,null,null,null,null,null,"","","","","","",0,0,0,0,0,0]
[{"$f":"jogo!A349","v":"18.10. 18:00"},{"$f":"jogo!B349","v":"Flamengo"},null,"x",null,{"$f":"jogo!D349","v":"Bahia"},{"$f":"jogo!E349","v":"Maracanã"},null,null,null,null,null,null,null,null,null,null,null,null,null,null,null,"","","","","","",0,0,0,0,0,0]
[{"$f":"jogo!A350","v":"18.10. 18:00"},{"$f":"jogo!B350","v":"Fluminense"},null,"x",null,{"$f":"jogo!D350","v":"São Paulo"},{"$f":"jogo!E350","v":"Maracanã"},null,null,null,null,null,null,null,null,null,null,null,null,null,null,null,"","","","","","",0,0,0,0,0,0]
[{"$f":"jogo!A351","v":"18.10. 18:00"},{"$f":"jogo!B351","v":"Palmeiras"},null,"x",null,{"$f":"jogo!D351","v":"Ponte Preta"},{"$f":"jogo!E351","v":"Allianz Parque"},null,null,null,null,null,null,null,null,null,null,null,null,null,null,null,"","","","","","",0,0,0,0,0,0]
[{"$f":"jogo!A352","v":"18.10. 18:00"},{"$f":"jogo!B352","v":"Sport Recife"},null,"x",null,{"$f":"jogo!D352","v":"Santos"},{"$f":"jogo!E352","v":"Ilha do Retiro"},null,null,null,null,null,null,null,null,null,null,null,null,null,null,null,"","","","","","",0,0,0,0,0,0]
[{"$f":"jogo!A353","v":"18.10. 18:00"},{"$f":"jogo!B353","v":"Vitória"},null,"x",null,{"$f":"jogo!D353","v":"Atlético-PR"},{"$f":"jogo!E353","v":"Barradão"},null,null,null,null,null,null,null,null,null,null,null,null,null,null,null,"","","","","","",0,0,0,0,0,0]
["30 ª Rodada",null,null,null,null,null,null,null,null,null,null,null,null,null,null,null,null,null,null,null,null,null,"","","","","","",0,0,0,0,0,0]
["Data/Horário",null,null,null,null,null,"Local",null,null,null,null,null,null,null,null,null,null,null,null,null,null,null,"","","","","","",0,0,0,0,0,0]
[{"$f":"jogo!A356","v":"21.10. 18:00"},{"$f":"jogo!B356","v":"Atlético-PR"},null,"x",null,{"$f":"jogo!D356","v":"Sport Recife"},{"$f":"jogo!E356","v":"Arena da Baixada"},null,null,null,null,null,null,null,null,null,null,null,null,null,null,null,"","","","","","",0,0,0,0,0,0]
[{"$f":"jogo!A357","v":"21.10. 18:00"},{"$f":"jogo!B357","v":"Bahia"},null,"x",null,{"$f":"jogo!D357","v":"Vitória"},{"$f":"jogo!E357","v":"Arena Fonte Nova"},null,null,null,null,null,null,null,null,null,null,null,null,null,null,null,"","","","","","",0,0,0,0,0,0]
[{"$f":"jogo!A358","v":"21.10. 18:00"},{"$f":"jogo!B358","v":"Botafogo"},null,"x",null,{"$f":"jogo!D358","v":"Corinthians"},{"$f":"jogo!E358","v":"Nilton Santos"},null,null,null,null,null,null,null,null,null,null,null,null,null,null,null,"","","","","","",0,0,0,0,0,0]
[{"$f":"jogo!A359","v":"21.10. 18:00"},{"$f":"jogo!B359","v":"Chapecoense"},null,"x",null,{"$f":"jogo!D359","v":"Fluminense"},{"$f":"jogo!E359","v":"Arena Condá"},null,null,null,null,null,null,null,null,null,null,null,null,null,null,null,"","","","","","",0,0,0,0,0,0]
[{"$f":"jogo!A360","v":"21.10. 18:00"},{"$f":"jogo!B360","v":"Cruzeiro"},null,"x",null,{"$f":"jogo!D360","v":"Atlético-MG"},{"$f":"jogo!E360","v":"Mineirão"},null,null,null,null,null,null,null,null,null,null,null,null,null,null,null,"","","","","","",0,0,0,0,0,0]
[{"$f":"jogo!A361","v":"21.10. 18:00"},{"$f":"jogo!B361","v":"Grêmio"},null,"x",null,{"$f":"jogo!D361","v":"Palmeiras"},{"$f":"jogo!E361","v":"Arena do Grêmio"},null,null,null,null,null,null,null,null,null,null,null,null,null,null,null,"","","","","","",0,0,0,0,0,0]
[{"$f":"jogo!A362","v":"21.10. 18:00"},{"$f":"jogo!B362","v":"Ponte Preta"},null,"x",null,{"$f":"jogo!D362","v":"Avaí"},{"$f":"jogo!E362","v":"Moisés Lucarelli"},null,null,null,null,null,null,null,null,null,null,null,null,null,null,null,"","","","","","",0,0,0,0,0,0]
[{"$f":"jogo!A363","v":"21.10. 18:00"},{"$f":"jogo!B363","v":"Santos"},null,"x",null,{"$f":"jogo!D363","v":"Atlético-GO"},{"$f":"jogo!E363","v":"Vila Belmiro"},null,null,null,null,null,null,null,null,null,null,null,null,null,null,null,"","","","","","",0,0,0,0,0,0]
[{"$f":"jogo!A364","v":"21.10. 18:00"},{"$f":"jogo!B364","v":"São Paulo"},null,"x",null,{"$f":"jogo!D364","v":"Flamengo"},{"$f":"jogo!E364","v":"Morumbi"},null,null,null,null,null,null,null,null,null,null,null,null,null,null,null,"","","","","","",0,0,0,0,0,0]
[{"$f":"jogo!A365","v":"21.10. 18:00"},{"$f":"jogo!B365","v":"Vasco"},null,"x",null,{"$f":"jogo!D365","v":"Coritiba"},{"$f":"jogo!E365","v":"São Januário"},null,null,null,null,null,null,null,null,null,null,null,null,null,null,null,"","","","","","",0,0,0,0,0,0]
["31 ª Rodada",null,null,null,null,null,null,null,null,null,null,null,null,null,null,null,null,null,null,null,null,null,"","","","","","",0,0,0,0,0,0]
["Data/Horário",null,null,null,null,null,"Local",null,null,null,null,null,null,null,null,null,null,null,null,null,null,null,"","","","","","",0,0,0,0,0,0]
[{"$f":"jogo!A368","v":"28.10. 18:00"},{"$f":"jogo!B368","v":"Atlético-MG"},null,"x",null,{"$f":"jogo!D368","v":"Botafogo"},{"$f":"jogo!E368","v":"Independência"},null,null,null,null,null,null,null,null,null,null,null,null,null,null,null,"","","","","","",0,0,0,0,0,0]
[{"$f":"jogo!A369","v":"28.10. 18:00"},{"$f":"jogo!B369","v":"Atlético-PR"},null,"x",null,{"$f":"jogo!D369","v":"Chapecoense"},{"$f":"jogo!E369","v":"Arena da Baixada"},null,null,null,null,null,null,null,null,null,null,null,null,null,null,null,"","","","","","",0,0,0,0,0,0]
[{"$f":"jogo!A370","v":"28.10. 18:00"},{"$f":"jogo!B370","v":"Avaí"},null,"x",null,{"$f":"jogo!D370","v":"Grêmio"},{"$f":"jogo!E370","v":"Ressacada"},null,null,null,null,null,null,null,null,null,null,null,null,null,null,null,"","","","","","",0,0,0,0,0,0]
[{"$f":"jogo!A371","v":"28.10. 18:00"},{"$f":"jogo!B371","v":"Flamengo"},null,"x",null,{"$f":"jogo!D371","v":"Vasco"},{"$f":"jogo!E371","v":"Maracanã"},null,null,null,null,null,null,null,null,null,null,null,null,null,null,null,"","","","","","",0,0,0,0,0,0]
[{"$f":"jogo!A372","v":"28.10. 18:00"},{"$f":"jogo!B372","v":"Fluminense"},null,"x",null,{"$f":"jogo!D372","v":"Bahia"},{"$f":"jogo!E372","v":"Maracanã"},null,null,null,null,null,null,null,null,null,null,null,null,null,null,null,"","","","","","",0,0,0,0,0,0]
[{"$f":"jogo!A373","v":"28.10. 18:00"},{"$f":"jogo!B373","v":"Palmeiras"},null,"x",null,{"$f":"jogo!D373","v":"Cruzeiro"},{"$f":"jogo!E373","v":"Allianz Parque"},null,null,null,null,null,null,null,null,null,null,null,null,null,null,null,"","","","","","",0,0,0,0,0,0]
[{"$f":"jogo!A374","v":"28.10. 18:00"},{"$f":"jogo!B374","v":"Ponte Preta"},null,"x",null,{"$f":"jogo!D374","v":"Corinthians"},{"$f":"jogo!E374","v":"Moisés Lucarelli"},null,null,null,null,null,null,null,null,null,null,null,null,null,null,null,"","","","","","",0,0,0,0,0,0]
[{"$f":"jogo!A375","v":"28.10. 18:00"},{"$f":"jogo!B375","v":"São Paulo"},null,"x",null,{"$f":"jogo!D375","v":"Santos"},{"$f":"jogo!E375","v":"Morumbi"},null,null,null,null,null,null,null,null,null,null,null,null,null,null,null,"","","","","","",0,0,0,0,0,0]
[{"$f":"jogo!A376","v":"28.10. 18:00"},{"$f":"jogo!B376","v":"Sport Recife"},null,"x",null,{"$f":"jogo!D376","v":"Coritiba"},{"$f":"jogo!E376","v":"Ilha do Retiro"},null,null,null,null,null,null,null,null,null,null,null,null,null,null,null,"","","","","","",0,0,0,0,0,0]
[{"$f":"jogo!A377","v":"28.10. 18:00"},{"$f":"jogo!B377","v":"Vitória"},null,"x",null,{"$f":"jogo!D377","v":"Atlético-GO"},{"$f":"jogo!E377","v":"Barradão"},null,null,null,null,null,null,null,null,null,null,null,null,null,null,null,"","","","","","",0,0,0,0,0,0]
["32 ª Rodada",null,null,null,null,null,null,null,null,null,null,null,null,null,null,null,null,null,null,null,null,null,"","","","","","",0,0,0,0,0,0]
["Data/Horário",null,null,null,null,null,"Local",null,null,null,null,null,null,null,null,null,null,null,null,null,null,null,"","","","","","",0,0,0,0,0,0]
[{"$f":"jogo!A380","v":"04.11. 19:00"},{"$f":"jogo!B380","v":"Atlético-GO"},null,"x",null,{"$f":"jogo!D380","v":"São Paulo"},{"$f":"jogo!E380","v":"Serra Dourada"},null,null,null,null,null,null,null,null,null,null,null,null,null,null,null,"","","","","","",0,0,0,0,0,0]
[{"$f":"jogo!A381","v":"04.11. 19:00"},{"$f":"jogo!B381","v":"Bahia"},null,"x",null,{"$f":"jogo!D381","v":"Ponte Preta"},{"$f":"jogo!E381","v":"Arena Fonte Nova"},null,null,null,null,null,null,null,null,null,null,null,null,null,null,null,"","","","","","",0,0,0,0,0,0]
[{"$f":"jogo!A382","v":"04.11. 19:00"},{"$f":"jogo!B382","v":"Botafogo"},null,"x",null,{"$f":"jogo!D382","v":"Fluminense"},{"$f":"jogo!E382","v":"Nilton Santos"},null,null,null,null,null,null,null,null,null,null,null,null,null,null,null,"","","","","","",0,0,0,0,0,0]
[{"$f":"jogo!A383","v":"04.11. 19:00"},{"$f":"jogo!B383","v":"Chapecoense"},null,"x",null,{"$f":"jogo!D383","v":"Sport Recife"},{"$f":"jogo!E383","v":"Arena Condá"},null,null,null,null,null,null,null,null,null,null,null,null,null,null,null,"","","","","","",0,0,0,0,0,0]
[{"$f":"jogo!A384","v":"04.11. 19:00"},{"$f":"jogo!B384","v":"Corinthians"},null,"x",null,{"$f":"jogo!D384","v":"Palmeiras"},{"$f":"jogo!E384","v":"Arena Corinthians"},null,null,null,null,null,null,null,null,null,null,null,null,null,null,null,"","","","","","",0,0,0,0,0,0]
[{"$f":"jogo!A385","v":"04.11. 19:00"},{"$f":"jogo!B385","v":"Coritiba"},null,"x",null,{"$f":"jogo!D385","v":"Avaí"},{"$f":"jogo!E385","v":"Couto Pereira"},null,null,null,null,null,null,null,null,null,null,null,null,null,null,null,"","","","","","",0,0,0,0,0,0]
[{"$f":"jogo!A386","v":"04.11. 19:00"},{"$f":"jogo!B386","v":"Cruzeiro"},null,"x",null,{"$f":"jogo!D386","v":"Atlético-PR"},{"$f":"jogo!E386","v":"Mineirão"},null,null,null,null,null,null,null,null,null,null,null,null,null,null,null,"","","","","","",0,0,0,0,0,0]
[{"$f":"jogo!A387","v":"04.11. 19:00"},{"$f":"jogo!B387","v":"Grêmio"},null,"x",null,{"$f":"jogo!D387","v":"Flamengo"},{"$f":"jogo!E387","v":"Arena do Grêmio"},null,null,null,null,null,null,null,null,null,null,null,null,null,null,null,"","","","","","",0,0,0,0,0,0]
[{"$f":"jogo!A388","v":"04.11. 19:00"},{"$f":"jogo!B388","v":"Santos"},null,"x",null,{"$f":"jogo!D388","v":"Atlético-MG"},{"$f":"jogo!E388","v":"Vila Belmiro"},null,null,null,null,null,null,null,null,null,null,null,null,null,null,null,"","","","","","",0,0,0,0,0,0]
[{"$f":"jogo!A389","v":"04.11. 19:00"},{"$f":"jogo!B389","v":"Vasco"},null,"x",null,{"$f":"jogo!D389","v":"Vitória"},{"$f":"jogo!E389","v":"São Januário"},null,null,null,null,null,null,null,null,null,null,null,null,null,null,null,"","","","","","",0,0,0,0,0,0]
["33 ª Rodada",null,null,null,null,null,null,null,null,null,null,null,null,null,null,null,null,null,null,null,null,null,{"$f":"IF(C390&E390=\"\",\"\",IF(C390=E390,1,IF(C390>E390,3,IF(C390<E390,0))))","v":""},{"$f":"IF(C390&E390=\"\",\"\",IF(E390=C390,1,IF(C390<E390,3,IF(C390>E390,0))))","v":""},{"$f":"IF(C390&E390=\"\",\"\",IF(C390&E390<>\"\",1))","v":""},{"$f":"IF(C390&E390=\"\",\"\",IF(C390&E390<>\"\",1))","v":""},{"$f":"IF(C390=\"\",\"\",C390)","v":""},{"$f":"IF(E390=\"\",\"\",E390)","v":""},0,0,0,0,0,0]
["Data/Horário",null,null,null,null,null,"Local",null,null,null,null,null,null,null,null,null,null,null,null,null,null,null,"","","","","","",{"$f":"IF(W391=3,1,0)","v":0},{"$f":"IF(X391=3,1,0)","v":0},{"$f":"IF(W391=1,1,0)","v":0},{"$f":"IF(X391=1,1,0)","v":0},{"$f":"IF(W391=0,1,0)","v":0},{"$f":"IF(X391=0,1,0)","v":0}]
[{"$f":"jogo!A392","v":"08.11. 19:00"},{"$f":"jogo!B392","v":"Atlético-MG"},null,"x",null,{"$f":"jogo!D392","v":"Atlético-GO"},{"$f":"jogo!E392","v":"Independência"},null,null,null,null,null,null,null,null,null,null,null,null,null,null,null,"","","","","","",0,0,0,0,0,0]
[{"$f":"jogo!A393","v":"08.11. 19:00"},{"$f":"jogo!B393","v":"Atlético-PR"},null,"x",null,{"$f":"jogo!D393","v":"Corinthians"},{"$f":"jogo!E393","v":"Arena da Baixada"},null,null,null,null,null,null,null,null,null,null,null,null,null,null,null,"","","","","","",0,0,0,0,0,0]
[{"$f":"jogo!A394","v":"08.11. 19:00"},{"$f":"jogo!B394","v":"Avaí"},null,"x",null,{"$f":"jogo!D394","v":"Bahia"},{"$f":"jogo!E394","v":"Ressacada"},null,null,null,null,null,null,null,null,null,null,null,null,null,null,null,"","","","","","",0,0,0,0,0,0]
[{"$f":"jogo!A395","v":"08.11. 19:00"},{"$f":"jogo!B395","v":"Flamengo"},null,"x",null,{"$f":"jogo!D395","v":"Cruzeiro"},{"$f":"jogo!E395","v":"Maracanã"},null,null,null,null,null,null,null,null,null,null,null,null,null,null,null,"","","","","","",0,0,0,0,0,0]
[{"$f":"jogo!A396","v":"08.11. 19:00"},{"$f":"jogo!B396","v":"Fluminense"},null,"x",null,{"$f":"jogo!D396","v":"Coritiba"},{"$f":"jogo!E396","v":"Maracanã"},null,null,null,null,null,null,null,null,null,null,null,null,null,null,null,"","","","","","",0,0,0,0,0,0]
[{"$f":"jogo!A397","v":"08.11. 19:00"},{"$f":"jogo!B397","v":"Ponte Preta"},null,"x",null,{"$f":"jogo!D397","v":"Grêmio"},{"$f":"jogo!E397","v":"Moisés Lucarelli"},null,null,null,null,null,null,null,null,null,null,null,null,null,null,null,"","","","","","",0,0,0,0,0,0]
[{"$f":"jogo!A398","v":"08.11. 19:00"},{"$f":"jogo!B398","v":"Santos"},null,"x",null,{"$f":"jogo!D398","v":"Vasco"},{"$f":"jogo!E398","v":"Vila Belmiro"},null,null,null,null,null,null,null,null,null,null,null,null,null,null,null,"","","","","","",0,0,0,0,0,0]
[{"$f":"jogo!A399","v":"08.11. 19:00"},{"$f":"jogo!B399","v":"São Paulo"},null,"x",null,{"$f":"jogo!D399","v":"Chapecoense"},{"$f":"jogo!E399","v":"Morumbi"},null,null,null,null,null,null,null,null,null,null,null,null,null,null,null,"","","","","","",0,0,0,0,0,0]
[{"$f":"jogo!A400","v":"08.11. 19:00"},{"$f":"jogo!B400","v":"Sport Recife"},null,"x",null,{"$f":"jogo!D400","v":"Botafogo"},{"$f":"jogo!E400","v":"Ilha do Retiro"},null,null,null,null,null,null,null,null,null,null,null,null,null,null,null,"","","","","","",0,0,0,0,0,0]
[{"$f":"jogo!A401","v":"08.11. 19:00"},{"$f":"jogo!B401","v":"Vitória"},null,"x",null,{"$f":"jogo!D401","v":"Palmeiras"},{"$f":"jogo!E401","v":"Barradão"},null,null,null,null,null,null,null,null,null,null,null,null,null,null,null,"","","","","","",0,0,0,0,0,0]
["34 ª Rodada",null,null,null,null,null,null,null,null,null,null,null,null,null,null,null,null,null,null,null,null,null,"","","","","","",0,0,0,0,0,0]
["Data/Horário",null,null,null,null,null,"Local",null,null,null,null,null,null,null,null,null,null,null,null,null,null,null,"","","","","","",0,0,0,0,0,0]
[{"$f":"jogo!A404","v":"11.11. 19:00"},{"$f":"jogo!B404","v":"Atlético-GO"},null,"x",null,{"$f":"jogo!D404","v":"Sport Recife"},{"$f":"jogo!E404","v":"Serra Dourada"},null,null,null,null,null,null,null,null,null,null,null,null,null,null,null,"","","","","","",0,0,0,0,0,0]
[{"$f":"jogo!A405","v":"11.11. 19:00"},{"$f":"jogo!B405","v":"Bahia"},null,"x",null,{"$f":"jogo!D405","v":"Atlético-MG"},{"$f":"jogo!E405","v":"Arena Fonte Nova"},null,null,null,null,null,null,null,null,null,null,null,null,null,null,null,"","","","","","",0,0,0,0,0,0]
[{"$f":"jogo!A406","v":"11.11. 19:00"},{"$f":"jogo!B406","v":"Botafogo"},null,"x",null,{"$f":"jogo!D406","v":"Atlético-PR"},{"$f":"jogo!E406","v":"Nilton Santos"},null,null,null,null,null,null,null,null,null,null,null,null,null,null,null,"","","","","","",0,0,0,0,0,0]
[{"$f":"jogo!A407","v":"11.11. 19:00"},{"$f":"jogo!B407","v":"Chapecoense"},null,"x",null,{"$f":"jogo!D407","v":"Santos"},{"$f":"jogo!E407","v":"Arena Condá"},null,null,null,null,null,null,null,null,null,null,null,null,null,null,null,"","","","","","",0,0,0,0,0,0]
[{"$f":"jogo!A408","v":"11.11. 19:00"},{"$f":"jogo!B408","v":"Corinthians"},null,"x",null,{"$f":"jogo!D408","v":"Avaí"},{"$f":"jogo!E408","v":"Arena Corinthians"},null,null,null,null,null,null,null,null,null,null,null,null,null,null,null,"","","","","","",0,0,0,0,0,0]
[{"$f":"jogo!A409","v":"11.11. 19:00"},{"$f":"jogo!B409","v":"Coritiba"},null,"x",null,{"$f":"jogo!D409","v":"Ponte Preta"},{"$f":"jogo!E409","v":"Couto Pereira"},null,null,null,null,null,null,null,null,null,null,null,null,null,null,null,"","","","","","",0,0,0,0,0,0]
[{"$f":"jogo!A410","v":"11.11. 19:00"},{"$f":"jogo!B410","v":"Cruzeiro"},null,"x",null,{"$f":"jogo!D410","v":"Fluminense"},{"$f":"jogo!E410","v":"Mineirão"},null,null,null,null,null,null,null,null,null,null,null,null,null,null,null,"","","","","","",0,0,0,0,0,0]
[{"$f":"jogo!A411","v":"11.11. 19:00"},{"$f":"jogo!B411","v":"Grêmio"},null,"x",null,{"$f":"jogo!D411","v":"Vitória"},{"$f":"jogo!E411","v":"Arena do Grêmio"},null,null,null,null,null,null,null,null,null,null,null,null,null,null,null,"","","","","","",0,0,0,0,0,0]
[{"$f":"jogo!A412","v":"11.11. 19:00"},{"$f":"jogo!B412","v":"Palmeiras"},null,"x",null,{"$f":"jogo!D412","v":"Flamengo"},{"$f":"jogo!E412","v":"Allianz Parque"},null,null,null,null,null,null,null,null,null,null,null,null,null,null,null,"","","","","","",0,0,0,0,0,0]
[{"$f":"jogo!A413","v":"11.11. 19:00"},{"$f":"jogo!B413","v":"Vasco"},null,"x",null,{"$f":"jogo!D413","v":"São Paulo"},{"$f":"jogo!E413","v":"São Januário"},null,null,null,null,null,null,null,null,null,null,null,null,null,null,null,"","","","","","",0,0,0,0,0,0]
["35 ª Rodada",null,null,null,null,null,null,null,null,null,null,null,null,null,null,null,null,null,null,null,null,null,"","","","","","",0,0,0,0,0,0]
["Data/Horário",null,null,null,null,null,"Local",null,null,null,null,null,null,null,null,null,null,null,null,null,null,null,"","","","","","",0,0,0,0,0,0]
[{"$f":"jogo!A416","v":"15.11. 19:00"},{"$f":"jogo!B416","v":"Bahia"},null,"x",null,{"$f":"jogo!D416","v":"Santos"},{"$f":"jogo!E416","v":"Arena Fonte Nova"},null,null,null,null,null,null,null,null,null,null,null,null,null,null,null,"","","","","","",0,0,0,0,0,0]
[{"$f":"jogo!A417","v":"15.11. 19:00"},{"$f":"jogo!B417","v":"Botafogo"},null,"x",null,{"$f":"jogo!D417","v":"Atlético-GO"},{"$f":"jogo!E417","v":"Nilton Santos"},null,null,null,null,null,null,null,null,null,null,null,null,null,null,null,"","","","","","",0,0,0,0,0,0]
[{"$f":"jogo!A418","v":"15.11. 19:00"},{"$f":"jogo!B418","v":"Chapecoense"},null,"x",null,{"$f":"jogo!D418","v":"Vitória"},{"$f":"jogo!E418","v":"Arena Condá"},null,null,null,null,null,null,null,null,null,null,null,null,null,null,null,"","","","","","",0,0,0,0,0,0]
[{"$f":"jogo!A419","v":"15.11. 19:00"},{"$f":"jogo!B419","v":"Corinthians"},null,"x",null,{"$f":"jogo!D419","v":"Fluminense"},{"$f":"jogo!E419","v":"Arena Corinthians"},null,null,null,null,null,null,null,null,null,null,null,null,null,null,null,"","","","","","",0,0,0,0,0,0]
[{"$f":"jogo!A420","v":"15.11. 19:00"},{"$f":"jogo!B420","v":"Coritiba"},null,"x",null,{"$f":"jogo!D420","v":"Flamengo"},{"$f":"jogo!E420","v":"Couto Pereira"},null,null,null,null,null,null,null,null,null,null,null,null,null,null,null,"","","","","","",0,0,0,0,0,0]
[{"$f":"jogo!A421","v":"15.11. 19:00"},{"$f":"jogo!B421","v":"Cruzeiro"},null,"x",null,{"$f":"jogo!D421","v":"Avaí"},{"$f":"jogo!E421","v":"Mineirão"},null,null,null,null,null,null,null,null,null,null,null,null,null,null,null,"","","","","","",0,0,0,0,0,0]
[{"$f":"jogo!A422","v":"15.11. 19:00"},{"$f":"jogo!B422","v":"Grêmio"},null,"x",null,{"$f":"jogo!D422","v":"São Paulo"},{"$f":"jogo!E422","v":"Arena do Grêmio"},null,null,null,null,null,null,null,null,null,null,null,null,null,null,null,"","","","","","",0,0,0,0,0,0]
[{"$f":"jogo!A423","v":"15.11. 19:00"},{"$f":"jogo!B423","v":"Palmeiras"},null,"x",null,{"$f":"jogo!D423","v":"Sport Recife"},{"$f":"jogo!E423","v":"Allianz Parque"},null,null,null,null,null,null,null,null,null,null,null,null,null,null,null,"","","","","","",0,0,0,0,0,0]
[{"$f":"jogo!A424","v":"15.11. 19:00"},{"$f":"jogo!B424","v":"Ponte Preta"},null,"x",null,{"$f":"jogo!D424","v":"Atlético-PR"},{"$f":"jogo!E424","v":"Moisés Lucarelli"},null,null,null,null,null,null,null,null,null,null,null,null,null,null,null,"","","","","","",0,0,0,0,0,0]
[{"$f":"jogo!A425","v":"15.11. 19:00"},{"$f":"jogo!B425","v":"Vasco"},null,"x",null,{"$f":"jogo!D425","v":"Atlético-MG"},{"$f":"jogo!E425","v":"São Januário"},null,null,null,null,null,null,null,null,null,null,null,null,null,null,null,"","","","","","",0,0,0,0,0,0]
["36 ª Rodada",null,null,null,null,null,null,null,null,null,null,null,null,null,null,null,null,null,null,null,null,null,"","","","","","",0,0,0,0,0,0]
["Data/Horário",null,null,null,null,null,"Local",null,null,null,null,null,null,null,null,null,null,null,null,null,null,null,"","","","","","",0,0,0,0,0,0]
[{"$f":"jogo!A428","v":"18.11. 19:00"},{"$f":"jogo!B428","v":"Atlético-GO"},null,"x",null,{"$f":"jogo!D428","v":"Chapecoense"},{"$f":"jogo!E428","v":"Serra Dourada"},null,null,null,null,null,null,null,null,null,null,null,null,null,null,null,"","","","","","",0,0,0,0,0,0]
[{"$f":"jogo!A429","v":"18.11. 19:00"},{"$f":"jogo!B429","v":"Atlético-MG"},null,"x",null,{"$f":"jogo!D429","v":"Coritiba"},{"$f":"jogo!E429","v":"Independência"},null,null,null,null,null,null,null,null,null,null,null,null,null,null,null,"","","","","","",0,0,0,0,0,0]
[{"$f":"jogo!A430","v":"18.11. 19:00"},{"$f":"jogo!B430","v":"Atlético-PR"},null,"x",null,{"$f":"jogo!D430","v":"Vasco"},{"$f":"jogo!E430","v":"Arena da Baixada"},null,null,null,null,null,null,null,null,null,null,null,null,null,null,null,"","","","","","",0,0,0,0,0,0]
[{"$f":"jogo!A431","v":"18.11. 19:00"},{"$f":"jogo!B431","v":"Avaí"},null,"x",null,{"$f":"jogo!D431","v":"Palmeiras"},{"$f":"jogo!E431","v":"Ressacada"},null,null,null,null,null,null,null,null,null,null,null,null,null,null,null,"","","","","","",0,0,0,0,0,0]
[{"$f":"jogo!A432","v":"18.11. 19:00"},{"$f":"jogo!B432","v":"Flamengo"},null,"x",null,{"$f":"jogo!D432","v":"Corinthians"},{"$f":"jogo!E432","v":"Maracanã"},null,null,null,null,null,null,null,null,null,null,null,null,null,null,null,"","","","","","",0,0,0,0,0,0]
[{"$f":"jogo!A433","v":"18.11. 19:00"},{"$f":"jogo!B433","v":"Fluminense"},null,"x",null,{"$f":"jogo!D433","v":"Ponte Preta"},{"$f":"jogo!E433","v":"Maracanã"},null,null,null,null,null,null,null,null,null,null,null,null,null,null,null,"","","","","","",0,0,0,0,0,0]
[{"$f":"jogo!A434","v":"18.11. 19:00"},{"$f":"jogo!B434","v":"Santos"},null,"x",null,{"$f":"jogo!D434","v":"Grêmio"},{"$f":"jogo!E434","v":"Vila Belmiro"},null,null,null,null,null,null,null,null,null,null,null,null,null,null,null,"","","","","","",0,0,0,0,0,0]
[{"$f":"jogo!A435","v":"18.11. 19:00"},{"$f":"jogo!B435","v":"São Paulo"},null,"x",null,{"$f":"jogo!D435","v":"Botafogo"},{"$f":"jogo!E435","v":"Morumbi"},null,null,null,null,null,null,null,null,null,null,null,null,null,null,null,"","","","","","",0,0,0,0,0,0]
[{"$f":"jogo!A436","v":"18.11. 19:00"},{"$f":"jogo!B436","v":"Sport Recife"},null,"x",null,{"$f":"jogo!D436","v":"Bahia"},{"$f":"jogo!E436","v":"Ilha do Retiro"},null,null,null,null,null,null,null,null,null,null,null,null,null,null,null,"","","","","","",0,0,0,0,0,0]
[{"$f":"jogo!A437","v":"18.11. 19:00"},{"$f":"jogo!B437","v":"Vitória"},null,"x",null,{"$f":"jogo!D437","v":"Cruzeiro"},{"$f":"jogo!E437","v":"Barradão"},null,null,null,null,null,null,null,null,null,null,null,null,null,null,null,"","","","","","",0,0,0,0,0,0]
["37 ª Rodada",null,null,null,null,null,null,null,null,null,null,null,null,null,null,null,null,null,null,null,null,null,"","","","","","",0,0,0,0,0,0]
["Data/Horário",null,null,null,null,null,"Local",null,null,null,null,null,null,null,null,null,null,null,null,null,null,null,"","","","","","",0,0,0,0,0,0]
[{"$f":"jogo!A440","v":"25.11. 19:00"},{"$f":"jogo!B440","v":"Avaí"},null,"x",null,{"$f":"jogo!D440","v":"Atlético-PR"},{"$f":"jogo!E440","v":"Ressacada"},null,null,null,null,null,null,null,null,null,null,null,null,null,null,null,"","","","","","",0,0,0,0,0,0]
[{"$f":"jogo!A441","v":"25.11. 19:00"},{"$f":"jogo!B441","v":"Bahia"},null,"x",null,{"$f":"jogo!D441","v":"Chapecoense"},{"$f":"jogo!E441","v":"Arena Fonte Nova"},null,null,null,null,null,null,null,null,null,null,null,null,null,null,null,"","","","","","",0,0,0,0,0,0]
[{"$f":"jogo!A442","v":"25.11. 19:00"},{"$f":"jogo!B442","v":"Corinthians"},null,"x",null,{"$f":"jogo!D442","v":"Atlético-MG"},{"$f":"jogo!E442","v":"Arena Corinthians"},null,null,null,null,null,null,null,null,null,null,null,null,null,null,null,"","","","","","",0,0,0,0,0,0]
[{"$f":"jogo!A443","v":"25.11. 19:00"},{"$f":"jogo!B443","v":"Coritiba"},null,"x",null,{"$f":"jogo!D443","v":"São Paulo"},{"$f":"jogo!E443","v":"Couto Pereira"},null,null,null,null,null,null,null,null,null,null,null,null,null,null,null,"","","","","","",0,0,0,0,0,0]
[{"$f":"jogo!A444","v":"25.11. 19:00"},{"$f":"jogo!B444","v":"Cruzeiro"},null,"x",null,{"$f":"jogo!D444","v":"Vasco"},{"$f":"jogo!E444","v":"Mineirão"},null,null,null,null,null,null,null,null,null,null,null,null,null,null,null,"","","","","","",0,0,0,0,0,0]
[{"$f":"jogo!A445","v":"25.11. 19:00"},{"$f":"jogo!B445","v":"Flamengo"},null,"x",null,{"$f":"jogo!D445","v":"Santos"},{"$f":"jogo!E445","v":"Maracanã"},null,null,null,null,null,null,null,null,null,null,null,null,null,null,null,"","","","","","",0,0,0,0,0,0]
[{"$f":"jogo!A446","v":"25.11. 19:00"},{"$f":"jogo!B446","v":"Fluminense"},null,"x",null,{"$f":"jogo!D446","v":"Sport Recife"},{"$f":"jogo!E446","v":"Maracanã"},null,null,null,null,null,null,null,null,null,null,null,null,null,null,null,"","","","","","",0,0,0,0,0,0]
[{"$f":"jogo!A447","v":"25.11. 19:00"},{"$f":"jogo!B447","v":"Grêmio"},null,"x",null,{"$f":"jogo!D447","v":"Atlético-GO"},{"$f":"jogo!E447","v":"Arena do Grêmio"},null,null,null,null,null,null,null,null,null,null,null,null,null,null,null,"","","","","","",0,0,0,0,0,0]
[{"$f":"jogo!A448","v":"25.11. 19:00"},{"$f":"jogo!B448","v":"Palmeiras"},null,"x",null,{"$f":"jogo!D448","v":"Botafogo"},{"$f":"jogo!E448","v":"Allianz Parque"},null,null,null,null,null,null,null,null,null,null,null,null,null,null,null,"","","","","","",0,0,0,0,0,0]
[{"$f":"jogo!A449","v":"25.11. 19:00"},{"$f":"jogo!B449","v":"Ponte Preta"},null,"x",null,{"$f":"jogo!D449","v":"Vitória"},{"$f":"jogo!E449","v":"Moisés Lucarelli"},null,null,null,null,null,null,null,null,null,null,null,null,null,null,null,"","","","","","",0,0,0,0,0,0]
["38 ª Rodada",null,null,null,null,null,null,null,null,null,null,null,null,null,null,null,null,null,null,null,null,null,"","","","","","",0,0,0,0,0,0]
["Data/Horário",null,null,null,null,null,"Local",null,null,null,null,null,null,null,null,null,null,null,null,null,null,null,"","","","","","",0,0,0,0,0,0]
[{"$f":"jogo!A452","v":"03.12. 19:00"},{"$f":"jogo!B452","v":"Atlético-GO"},null,"x",null,{"$f":"jogo!D452","v":"Fluminense"},{"$f":"jogo!E452","v":"Serra Dourada"},null,null,null,null,null,null,null,null,null,null,null,null,null,null,null,"","","","","","",0,0,0,0,0,0]
[{"$f":"jogo!A453","v":"03.12. 19:00"},{"$f":"jogo!B453","v":"Atlético-MG"},null,"x",null,{"$f":"jogo!D453","v":"Grêmio"},{"$f":"jogo!E453","v":"Independência"},null,null,null,null,null,null,null,null,null,null,null,null,null,null,null,"","","","","","",0,0,0,0,0,0]
[{"$f":"jogo!A454","v":"03.12. 19:00"},{"$f":"jogo!B454","v":"Atlético-PR"},null,"x",null,{"$f":"jogo!D454","v":"Palmeiras"},{"$f":"jogo!E454","v":"Arena da Baixada"},null,null,null,null,null,null,null,null,null,null,null,null,null,null,null,{"$f":"IF(C454&E454=\"\",\"\",IF(C454=E454,1,IF(C454>E454,3,IF(C454<E454,0))))","v":""},{"$f":"IF(C454&E454=\"\",\"\",IF(E454=C454,1,IF(C454<E454,3,IF(C454>E454,0))))","v":""},{"$f":"IF(C454&E454=\"\",\"\",IF(C454&E454<>\"\",1))","v":""},{"$f":"IF(C454&E454=\"\",\"\",IF(C454&E454<>\"\",1))","v":""},{"$f":"IF(C454=\"\",\"\",C454)","v":""},{"$f":"IF(E454=\"\",\"\",E454)","v":""},0,0,0,0,0,0]
[{"$f":"jogo!A455","v":"03.12. 19:00"},{"$f":"jogo!B455","v":"Botafogo"},null,"x",null,{"$f":"jogo!D455","v":"Cruzeiro"},{"$f":"jogo!E455","v":"Nilton Santos"},null,null,null,null,null,null,null,null,null,null,null,null,null,null,null,"","","","","","",{"$f":"IF(W455=3,1,0)","v":0},{"$f":"IF(X455=3,1,0)","v":0},{"$f":"IF(W455=1,1,0)","v":0},{"$f":"IF(X455=1,1,0)","v":0},{"$f":"IF(W455=0,1,0)","v":0},{"$f":"IF(X455=0,1,0)","v":0}]
[{"$f":"jogo!A456","v":"03.12. 19:00"},{"$f":"jogo!B456","v":"Chapecoense"},null,"x",null,{"$f":"jogo!D456","v":"Coritiba"},{"$f":"jogo!E456","v":"Arena Condá"},null,null,null,null,null,null,null,null,null,null,null,null,null,null,null,"","","","","","",0,0,0,0,0,0]
[{"$f":"jogo!A457","v":"03.12. 19:00"},{"$f":"jogo!B457","v":"Santos"},null,"x",null,{"$f":"jogo!D457","v":"Avaí"},{"$f":"jogo!E457","v":"Vila Belmiro"},null,null,null,null,null,null,null,null,null,null,null,null,null,null,null,"","","","","","",0,0,0,0,0,0]
[{"$f":"jogo!A458","v":"03.12. 19:00"},{"$f":"jogo!B458","v":"São Paulo"},null,"x",null,{"$f":"jogo!D458","v":"Bahia"},{"$f":"jogo!E458","v":"Morumbi"},null,null,null,null,null,null,null,null,null,null,null,null,null,null,null,"","","","","","",0,0,0,0,0,0]
[{"$f":"jogo!A459","v":"03.12. 19:00"},{"$f":"jogo!B459","v":"Sport Recife"},null,"x",null,{"$f":"jogo!D459","v":"Corinthians"},{"$f":"jogo!E459","v":"Ilha do Retiro"},null,null,null,null,null,null,null,null,null,null,null,null,null,null,null,"","","","","","",0,0,0,0,0,0]
[{"$f":"jogo!A460","v":"03.12. 19:00"},{"$f":"jogo!B460","v":"Vasco"},null,"x",null,{"$f":"jogo!D460","v":"Ponte Preta"},{"$f":"jogo!E460","v":"São Januário"},null,null,null,null,null,null,null,null,null,null,null,null,null,null,null,"","","","","","",0,0,0,0,0,0]
[{"$f":"jogo!A461","v":"03.12. 19:00"},{"$f":"jogo!B461","v":"Vitória"},null,"x",null,{"$f":"jogo!D461","v":"Flamengo"},{"$f":"jogo!E461","v":"Barradão"},null,null,null,null,null,null,null,null,null,null,null,null,null,null,null,"","","","","","",0,0,0,0,0,0]
[null,null,null,null,null,null,null,null,null,null,null,null,null,null,null,null,null,null,null,null,null,null,"","","","","","",0,0,0,0,0,0]
[null,null,null,null,null,null,null,null,null,null,null,null,null,null,null,null,null,null,null,null,null,null,"","","","","","",0,0,0,0,0,0]
[null,null,null,null,null,null,null,null,null,null,null,null,null,null,null,null,null,null,null,null,null,null,"","","","","","",0,0,0,0,0,0]
[null,null,null,null,null,null,null,null,null,null,null,null,null,null,null,null,null,null,null,null,null,null,"","","","","","",0,0,0,0,0,0]
[null,null,null,null,null,null,null,null,null,null,null,null,null,null,null,null,null,null,null,null,null,null,"","","","","","",0,0,0,0,0,0]
[null,null,null,null,null,null,null,null,null,null,null,null,null,null,null,null,null,null,null,null,null,null,"","","","","","",0,0,0,0,0,0]
[null,null,null,null,null,null,null,null,null,null,null,null,null,null,null,null,null,null,null,null,null,null,"","","","","","",0,0,0,0,0,0]
[null,null,null,null,null,null,null,null,null,null,null,null,null,null,null,null,null,null,null,null,null,null,"","","","","","",0,0,0,0,0,0]
[null,null,null,null,null,null,null,null,null,null,null,null,null,null,null,null,null,null,null,null,null,null,"","","","","","",0,0,0,0,0,0]
[null,null,null,null,null,null,null,null,null,null,null,null,null,null,null,null,null,null,null,null,null,null,"","","","","","",0,0,0,0,0,0]
[null,null,null,null,null,null,null,null,null,null,null,null,null,null,null,null,null,null,null,null,null,null,"","","","","","",0,0,0,0,0,0]
[null,null,null,null,null,null,null,null,null,null,null,null,null,null,null,null,null,null,null,null,null,null,"","","","","","",0,0,0,0,0,0]
[null,null,null,null,null,null,null,null,null,null,null,null,null,null,null,null,null,null,null,null,null,null,"","","","","","",0,0,0,0,0,0]
[null,null,null,null,null,null,null,null,null,null,null,null,null,null,null,null,null,null,null,null,null,null,"","","","","","",0,0,0,0,0,0]
[null,null,null,null,null,null,null,null,null,null,null,null,null,null,null,null,null,null,null,null,null,null,"","","","","","",0,0,0,0,0,0]
[null,null,null,null,null,null,null,null,null,null,null,null,null,null,null,null,null,null,null,null,null,null,"","","","","","",0,0,0,0,0,0]
[null,null,null,null,null,null,null,null,null,null,null,null,null,null,null,null,null,null,null,null,null,null,"","","","","","",0,0,0,0,0,0]
[null,null,null,null,null,null,null,null,null,null,null,null,null,null,null,null,null,null,null,null,null,null,"","","","","","",0,0,0,0,0,0]
[null,null,null,null,null,null,null,null,null,null,null,null,null,null,null,null,null,null,null,null,null,null,"","","","","","",0,0,0,0,0,0]
[null,null,null,null,null,null,null,null,null,null,null,null,null,null,null,null,null,null,null,null,null,null,"","","","","","",0,0,0,0,0,0]
[null,null,null,null,null,null,null,null,null,null,null,null,null,null,null,null,null,null,null,null,null,null,"","","","","","",0,0,0,0,0,0]
[null,null,null,null,null,null,null,null,null,null,null,null,null,null,null,null,null,null,null,null,null,null,"","","","","","",0,0,0,0,0,0]
[null,null,null,null,null,null,null,null,null,null,null,null,null,null,null,null,null,null,null,null,null,null,"","","","","","",0,0,0,0,0,0]
[null,null,null,null,null,null,null,null,null,null,null,null,null,null,null,null,null,null,null,null,null,null,"","","","","","",0,0,0,0,0,0]
[null,null,null,null,null,null,null,null,null,null,null,null,null,null,null,null,null,null,null,null,null,null,"","","","","","",0,0,0,0,0,0]
[null,null,null,null,null,null,null,null,null,null,null,null,null,null,null,null,null,null,null,null,null,null,"","","","","","",0,0,0,0,0,0]
[null,null,null,null,null,null,null,null,null,null,null,null,null,null,null,null,null,null,null,null,null,null,"","","","","","",0,0,0,0,0,0]
[null,null,null,null,null,null,null,null,null,null,null,null,null,null,null,null,null,null,null,null,null,null,"","","","","","",0,0,0,0,0,0]
[null,null,null,null,null,null,null,null,null,null,null,null,null,null,null,null,null,null,null,null,null,null,"","","","","","",0,0,0,0,0,0]
[null,null,null,null,null,null,null,null,null,null,null,null,null,null,null,null,null,null,null,null,null,null,"","","","","","",0,0,0,0,0,0]
[null,null,null,null,null,null,null,null,null,null,null,null,null,null,null,null,null,null,null,null,null,null,"","","","","","",0,0,0,0,0,0]
[null,null,null,null,null,null,null,null,null,null,null,null,null,null,null,null,null,null,null,null,null,null,"","","","","","",0,0,0,0,0,0]
[null,null,null,null,null,null,null,null,null,null,null,null,null,null,null,null,null,null,null,null,null,null,"","","","","","",0,0,0,0,0,0]
[null,null,null,null,null,null,null,null,null,null,null,null,null,null,null,null,null,null,null,null,null,null,"","","","","","",0,0,0,0,0,0]
[null,null,null,null,null,null,null,null,null,null,null,null,null,null,null,null,null,null,null,null,null,null,"","","","","","",0,0,0,0,0,0]
[null,null,null,null,null,null,null,null,null,null,null,null,null,null,null,null,null,null,null,null,null,null,"","","","","","",0,0,0,0,0,0]
[null,null,null,null,null,null,null,null,null,null,null,null,null,null,null,null,null,null,null,null,null,null,"","","","","","",0,0,0,0,0,0]
[null,null,null,null,null,null,null,null,null,null,null,null,null,null,null,null,null,null,null,null,null,null,"","","","","","",0,0,0,0,0,0]
[null,null,null,null,null,null,null,null,null,null,null,null,null,null,null,null,null,null,null,null,null,null,"","","","","","",{"$f":"IF(W500=3,1,0)","v":0},{"$f":"IF(X500=3,1,0)","v":0},{"$f":"IF(W500=1,1,0)","v":0},{"$f":"IF(X500=1,1,0)","v":0},{"$f":"IF(W500=0,1,0)","v":0},0]
[null,null,null,null,null,null,null,null,null,null,null,null,null,null,null,null,null,null,null,null,null,null,"","","","","","",{"$f":"IF(W501=3,1,0)","v":0},{"$f":"IF(X501=3,1,0)","v":0},{"$f":"IF(W501=1,1,0)","v":0},{"$f":"IF(X501=1,1,0)","v":0},{"$f":"IF(W501=0,1,0)","v":0},{"$f":"IF(X501=0,1,0)","v":0}]
[null,null,null,null,null,null,null,null,null,null,null,null,null,null,null,null,null,null,null,null,null,null,"","","","","","",0,0,0,0,0,0]
[null,null,null,null,null,null,null,null,null,null,null,null,null,null,null,null,null,null,null,null,null,null,"","","","","","",0,0,0,0,0,0]
[null,null,null,null,null,null,null,null,null,null,null,null,null,null,null,null,null,null,null,null,null,null,"","","","","","",0,0,0,0,0,0]
[null,null,null,null,null,null,null,null,null,null,null,null,null,null,null,null,null,null,null,null,null,null,"","","","","","",0,0,0,0,0,0]
[null,null,null,null,null,null,null,null,null,null,null,null,null,null,null,null,null,null,null,null,null,null,"","","","","","",0,0,0,0,0,0]
[null,null,null,null,null,null,null,null,null,null,null,null,null,null,null,null,null,null,null,null,null,null,"","","","","","",0,0,0,0,0,0]
[null,null,null,null,null,null,null,null,null,null,null,null,null,null,null,null,null,null,null,null,null,null,"","","","","","",0,0,0,0,0,0]
[null,null,null,null,null,null,null,null,null,null,null,null,null,null,null,null,null,null,null,null,null,null,"","","","","","",0,0,0,0,0,0]
[null,null,null,null,null,null,null,null,null,null,null,null,null,null,null,null,null,null,null,null,null,null,"","","","","","",0,0,0,0,0,0]
[null,null,null,null,null,null,null,null,null,null,null,null,null,null,null,null,null,null,null,null,null,null,"","","","","","",0,0,0,0,0,0]
[null,null,null,null,null,null,null,null,null,null,null,null,null,null,null,null,null,null,null,null,null,null,"","","","","","",0,0,0,0,0,0]
[null,null,null,null,null,null,null,null,null,null,null,null,null,null,null,null,null,null,null,null,null,null,"","","","","","",0,0,0,0,0,0]
[null,null,null,null,null,null,null,null,null,null,null,null,null,null,null,null,null,null,null,null,null,null,"","","","","","",0,0,0,0,0,0]
[null,null,null,null,null,null,null,null,null,null,null,null,null,null,null,null,null,null,null,null,null,null,"","","","","","",0,0,0,0,0,0]
[null,null,null,null,null,null,null,null,null,null,null,null,null,null,null,null,null,null,null,null,null,null,"","","","","","",0,0,0,0,0,0]
[null,null,null,null,null,null,null,null,null,null,null,null,null,null,null,null,null,null,null,null,null,null,"","","","","","",0,0,0,0,0,0]
[null,null,null,null,null,null,null,null,null,null,null,null,null,null,null,null,null,null,null,null,null,null,{"$f":"IF(C518&E518=\"\",\"\",IF(C518=E518,1,IF(C518>E518,3,IF(C518<E518,0))))","v":""},{"$f":"IF(C518&E518=\"\",\"\",IF(E518=C518,1,IF(C518<E518,3,IF(C518>E518,0))))","v":""},{"$f":"IF(C518&E518=\"\",\"\",IF(C518&E518<>\"\",1))","v":""},{"$f":"IF(C518&E518=\"\",\"\",IF(C518&E518<>\"\",1))","v":""},{"$f":"IF(C518=\"\",\"\",C518)","v":""},{"$f":"IF(E518=\"\",\"\",E518)","v":""},0,0,0,0,0,0]
[null,null,null,null,null,null,null,null,null,null,null,null,null,null,null,null,null,null,null,null,null,null,"","","","","","",0,0,0,0,0,0]
[null,null,null,null,null,null,null,null,null,null,null,null,null,null,null,null,null,null,null,null,null,null,"","","","","","",0,0,0,0,0,0]
[null,null,null,null,null,null,null,null,null,null,null,null,null,null,null,null,null,null,null,null,null,null,"","","","","","",0,0,0,0,0,0]
[null,null,null,null,null,null,null,null,null,null,null,null,null,null,null,null,null,null,null,null,null,null,"","","","","","",0,0,0,0,0,0]
[null,null,null,null,null,null,null,null,null,null,null,null,null,null,null,null,null,null,null,null,null,null,"","","","","","",0,0,0,0,0,0]
[null,null,null,null,null,null,null,null,null,null,null,null,null,null,null,null,null,null,null,null,null,null,"","","","","","",0,0,0,0,0,0]
[null,null,null,null,null,null,null,null,null,null,null,null,null,null,null,null,null,null,null,null,null,null,"","","","","","",0,0,0,0,0,0]
[null,null,null,null,null,null,null,null,null,null,null,null,null,null,null,null,null,null,null,null,null,null,"","","","","","",0,0,0,0,0,0]
[null,null,null,null,null,null,null,null,null,null,null,null,null,null,null,null,null,null,null,null,null,null,"","","","","","",0,0,0,0,0,0]
[null,null,null,null,null,null,null,null,null,null,null,null,null,null,null,null,null,null,null,null,null,null,"","","","","","",0,0,0,0,0,0]
[null,null,null,null,null,null,null,null,null,null,null,null,null,null,null,null,null,null,null,null,null,null,"","","","","","",0,0,0,0,0,0]
[null,null,null,null,null,null,null,null,null,null,null,null,null,null,null,null,null,null,null,null,null,null,"","","","","","",0,0,0,0,0,0]
[null,null,null,null,null,null,null,null,null,null,null,null,null,null,null,null,null,null,null,null,null,null,"","","","","","",0,0,0,0,0,0]
[null,null,null,null,null,null,null,null,null,null,null,null,null,null,null,null,null,null,null,null,null,null,"","","","","","",0,0,0,0,0,0]
[null,null,null,null,null,null,null,null,null,null,null,null,null,null,null,null,null,null,null,null,null,null,{"$f":"IF(C533&E533=\"\",\"\",IF(C533=E533,1,IF(C533>E533,3,IF(C533<E533,0))))","v":""},{"$f":"IF(C533&E533=\"\",\"\",IF(E533=C533,1,IF(C533<E533,3,IF(C533>E533,0))))","v":""},{"$f":"IF(C533&E533=\"\",\"\",IF(C533&E533<>\"\",1))","v":""},{"$f":"IF(C533&E533=\"\",\"\",IF(C533&E533<>\"\",1))","v":""},{"$f":"IF(C533=\"\",\"\",C533)","v":""},{"$f":"IF(E533=\"\",\"\",E533)","v":""},{"$f":"IF(W533=3,1,0)","v":0},{"$f":"IF(X533=3,1,0)","v":0},{"$f":"IF(W533=1,1,0)","v":0},{"$f":"IF(X533=1,1,0)","v":0},{"$f":"IF(W533=0,1,0)","v":0},{"$f":"IF(X533=0,1,0)","v":0}]
[null,null,null,null,null,null,null,null,null,null,null,null,null,null,null,null,null,null,null,null,null,null,"","","","","","",0,0,0,0,0,0]
[null,null,null,null,null,null,null,null,null,null,null,null,null,null,null,null,null,null,null,null,null,null,"","","","","","",0,0,0,0,0,0]
[null,null,null,null,null,null,null,null,null,null,null,null,null,null,null,null,null,null,null,null,null,null,"","","","","","",0,0,0,0,0,0]
[null,null,null,null,null,null,null,null,null,null,null,null,null,null,null,null,null,null,null,null,null,null,"","","","","","",0,0,0,0,0,0]
[null,null,null,null,null,null,null,null,null,null,null,null,null,null,null,null,null,null,null,null,null,null,"","","","","","",0,0,0,0,0,0]
[null,null,null,null,null,null,null,null,null,null,null,null,null,null,null,null,null,null,null,null,null,null,"","","","","","",0,0,0,0,0,0]
[null,null,null,null,null,null,null,null,null,null,null,null,null,null,null,null,null,null,null,null,null,null,"","","","","","",0,0,0,0,0,0]
[null,null,null,null,null,null,null,null,null,null,null,null,null,null,null,null,null,null,null,null,null,null,"","","","","","",0,0,0,0,0,0]
[null,null,null,null,null,null,null,null,null,null,null,null,null,null,null,null,null,null,null,null,null,null,"","","","","","",0,0,0,0,0,0]
[null,null,null,null,null,null,null,null,null,null,null,null,null,null,null,null,null,null,null,null,null,null,"","","","","","",0,0,0,0,0,0]
[null,null,null,null,null,null,null,null,null,null,null,null,null,null,null,null,null,null,null,null,null,null,"","","","","","",0,0,0,0,0,0]
[null,null,null,null,null,null,null,null,null,null,null,null,null,null,null,null,null,null,null,null,null,null,"","","","","","",0,0,0,0,0,0]
[null,null,null,null,null,null,null,null,null,null,null,null,null,null,null,null,null,null,null,null,null,null,"","","","","","",0,0,0,0,0,0]
[null,null,null,null,null,null,null,null,null,null,null,null,null,null,null,null,null,null,null,null,null,null,"","","","","","",0,0,0,0,0,0]
[null,null,null,null,null,null,null,null,null,null,null,null,null,null,null,null,null,null,null,null,null,null,"","","","","","",0,0,0,0,0,0]
[null,null,null,null,null,null,null,null,null,null,null,null,null,null,null,null,null,null,null,null,null,null,"","","","","","",0,0,0,0,0,0]
[null,null,null,null,null,null,null,null,null,null,null,null,null,null,null,null,null,null,null,null,null,null,"","","","","","",0,0,0,0,0,0]
[null,null,null,null,null,null,null,null,null,null,null,null,null,null,null,null,null,null,null,null,null,null,"","","","","","",0,0,0,0,0,0]
[null,null,null,null,null,null,null,null,null,null,null,null,null,null,null,null,null,null,null,null,null,null,"","","","","","",0,0,0,0,0,0]
[null,null,null,null,null,null,null,null,null,null,null,null,null,null,null,null,null,null,null,null,null,null,"","","","","","",0,0,0,0,0,0]
[null,null,null,null,null,null,null,null,null,null,null,null,null,null,null,null,null,null,null,null,null,null,{"$f":"IF(C554&E554=\"\",\"\",IF(C554=E554,1,IF(C554>E554,3,IF(C554<E554,0))))","v":""},{"$f":"IF(C554&E554=\"\",\"\",IF(E554=C554,1,IF(C554<E554,3,IF(C554>E554,0))))","v":""},{"$f":"IF(C554&E554=\"\",\"\",IF(C554&E554<>\"\",1))","v":""},{"$f":"IF(C554&E554=\"\",\"\",IF(C554&E554<>\"\",1))","v":""},{"$f":"IF(C554=\"\",\"\",C554)","v":""},{"$f":"IF(E554=\"\",\"\",E554)","v":""},{"$f":"IF(W554=3,1,0)","v":0},{"$f":"IF(X554=3,1,0)","v":0},{"$f":"IF(W554=1,1,0)","v":0},{"$f":"IF(X554=1,1,0)","v":0},{"$f":"IF(W554=0,1,0)","v":0},{"$f":"IF(X554=0,1,0)","v":0}]
[null,null,null,null,null,null,null,null,null,null,null,null,null,null,null,null,null,null,null,null,null,null,"","","","","","",0,0,0,0,0,0]
[null,null,null,null,null,null,null,null,null,null,null,null,null,null,null,null,null,null,null,null,null,null,"","","","","","",0,0,0,0,0,0]
[null,null,null,null,null,null,null,null,null,null,null,null,null,null,null,null,null,null,null,null,null,null,"","","","","","",0,0,0,0,0,0]
[null,null,null,null,null,null,null,null,null,null,null,null,null,null,null,null,null,null,null,null,null,null,"","","","","","",0,0,0,0,0,0]
[null,null,null,null,null,null,null,null,null,null,null,null,null,null,null,null,null,null,null,null,null,null,"","","","","","",0,0,0,0,0,0]
[null,null,null,null,null,null,null,null,null,null,null,null,null,null,null,null,null,null,null,null,null,null,"","","","","","",0,0,0,0,0,0]
[null,null,null,null,null,null,null,null,null,null,null,null,null,null,null,null,null,null,null,null,null,null,"","","","","","",0,0,0,0,0,0]
[null,null,null,null,null,null,null,null,null,null,null,null,null,null,null,null,null,null,null,null,null,null,"","","","","","",0,0,0,0,0,0]
[null,null,null,null,null,null,null,null,null,null,null,null,null,null,null,null,null,null,null,null,null,null,"","","","","","",0,0,0,0,0,0]
[null,null,null,null,null,null,null,null,null,null,null,null,null,null,null,null,null,null,null,null,null,null,"","","","","","",0,0,0,0,0,0]
[null,null,null,null,null,null,null,null,null,null,null,null,null,null,null,null,null,null,null,null,null,null,"","","","","","",0,0,0,0,0,0]
[null,null,null,null,null,null,null,null,null,null,null,null,null,null,null,null,null,null,null,null,null,null,"","","","","","",0,0,0,0,0,0]
[null,null,null,null,null,null,null,null,null,null,null,null,null,null,null,null,null,null,null,null,null,null,"","","","","","",0,0,0,0,0,0]
[null,null,null,null,null,null,null,null,null,null,null,null,null,null,null,null,null,null,null,null,null,null,"","","","","","",0,0,0,0,0,0]
[null,null,null,null,null,null,null,null,null,null,null,null,null,null,null,null,null,null,null,null,null,null,"","","","","","",0,0,0,0,0,0]
[null,null,null,null,null,null,null,null,null,null,null,null,null,null,null,null,null,null,null,null,null,null,"","","","","","",0,0,0,0,0,0]
[null,null,null,null,null,null,null,null,null,null,null,null,null,null,null,null,null,null,null,null,null,null,"","","","","","",0,0,0,0,0,0]
[null,null,null,null,null,null,null,null,null,null,null,null,null,null,null,null,null,null,null,null,null,null,"","","","","","",0,0,0,0,0,0]
[null,null,null,null,null,null,null,null,null,null,null,null,null,null,null,null,null,null,null,null,null,null,"","","","","","",0,0,0,0,0,0]
[null,null,null,null,null,null,null,null,null,null,null,null,null,null,null,null,null,null,null,null,null,null,"","","","","","",0,0,0,0,0,0]
[null,null,null,null,null,null,null,null,null,null,null,null,null,null,null,null,null,null,null,null,null,null,"","","","","","",0,0,0,0,0,0]
[null,null,null,null,null,null,null,null,null,null,null,null,null,null,null,null,null,null,null,null,null,null,"","","","","","",0,0,0,0,0,0]
[null,null,null,null,null,null,null,null,null,null,null,null,null,null,null,null,null,null,null,null,null,null,"","","","","","",0,0,0,0,0,0]
[null,null,null,null,null,null,null,null,null,null,null,null,null,null,null,null,null,null,null,null,null,null,"","","","","","",0,0,0,0,0,0]
[null,null,null,null,null,null,null,null,null,null,null,null,null,null,null,null,null,null,null,null,null,null,"","","","","","",0,0,0,0,0,0]
[null,null,null,null,null,null,null,null,null,null,null,null,null,null,null,null,null,null,null,null,null,null,"","","","","","",0,0,0,0,0,0]
[null,null,null,null,null,null,null,null,null,null,null,null,null,null,null,null,null,null,null,null,null,null,"","","","","","",0,0,0,0,0,0]
[null,null,null,null,null,null,null,null,null,null,null,null,null,null,null,null,null,null,null,null,null,null,"","","","","","",0,0,0,0,0,0]
[null,null,null,null,null,null,null,null,null,null,null,null,null,null,null,null,null,null,null,null,null,null,"","","","","","",0,0,0,0,0,0]
[null,null,null,null,null,null,null,null,null,null,null,null,null,null,null,null,null,null,null,null,null,null,"","","","","","",0,0,0,0,0,0]
[null,null,null,null,null,null,null,null,null,null,null,null,null,null,null,null,null,null,null,null,null,null,"","","","","","",0,0,0,0,0,0]
[null,null,null,null,null,null,null,null,null,null,null,null,null,null,null,null,null,null,null,null,null,null,"","","","","","",0,0,0,0,0,0]
[null,null,null,null,null,null,null,null,null,null,null,null,null,null,null,null,null,null,null,null,null,null,"","","","","","",0,0,0,0,0,0]
[null,null,null,null,null,null,null,null,null,null,null,null,null,null,null,null,null,null,null,null,null,null,"","","","","","",0,0,0,0,0,0]
[null,null,null,null,null,null,null,null,null,null,null,null,null,null,null,null,null,null,null,null,null,null,"","","","","","",0,0,0,0,0,0]
[null,null,null,null,null,null,null,null,null,null,null,null,null,null,null,null,null,null,null,null,null,null,"","","","","","",0,0,0,0,0,0]
[null,null,null,null,null,null,null,null,null,null,null,null,null,null,null,null,null,null,null,null,null,null,"","","","","","",0,0,0,0,0,0]
[null,null,null,null,null,null,null,null,null,null,null,null,null,null,null,null,null,null,null,null,null,null,"","","","","","",0,0,0,0,0,0]
[null,null,null,null,null,null,null,null,null,null,null,null,null,null,null,null,null,null,null,null,null,null,"","","","","","",0,0,0,0,0,0]
[null,null,null,null,null,null,null,null,null,null,null,null,null,null,null,null,null,null,null,null,null,null,"","","","","","",0,0,0,0,0,0]
[null,null,null,null,null,null,null,null,null,null,null,null,null,null,null,null,null,null,null,null,null,null,"","","","","","",0,0,0,0,0,0]
[null,null,null,null,null,null,null,null,null,null,null,null,null,null,null,null,null,null,null,null,null,null,"","","","","","",0,0,0,0,0,0]
[null,null,null,null,null,null,null,null,null,null,null,null,null,null,null,null,null,null,null,null,null,null,"","","","","","",0,0,0,0,0,0]

{"sheet":"jogo","index":1,"n_rows":461,"n_cols":9,"rows_kept":461,"cut":false,"hidden":false,"merged":[[54,0,54,3],[66,0,66,3],[78,0,78,3],[90,0,90,3],[102,0,102,3],[246,0,246,3],[114,0,114,3],[126,0,126,3],[138,0,138,3],[150,0,150,3],[162,0,162,3],[174,0,174,3],[186,0,186,3],[198,0,198,3],[210,0,210,3],[222,0,222,3],[234,0,234,3],[390,0,390,3],[258,0,258,3],[270,0,270,3],[282,0,282,3],[294,0,294,3],[306,0,306,3],[318,0,318,3],[330,0,330,3],[342,0,342,3],[354,0,354,3],[366,0,366,3],[378,0,378,3],[402,0,402,3],[414,0,414,3],[426,0,426,3],[438,0,438,3],[450,0,450,3],[5,0,5,3],[18,0,18,3],[30,0,30,3],[42,0,42,3],[6,7,6,8],[5,7,5,8],[5,4,6,4],[6,0,6,3]]}
[]
[]
[]
[]
[]
["Brasileirão 2017",null,null,null,"Locais Prováveis",null,null,"Brasileião 2017 Série A"]
["rodada 1",null,null,null,null,null,null,"Marticipantes / Mando"]
["15.05. 20:00","Flamengo","x","Atlético-MG",{"$f":"VLOOKUP(B8,$H$8:$I$27,2,FALSE)","v":"Maracanã"},null,null,"Flamengo","Maracanã"]
["14.05. 19:00","Corinthians","x","Chapecoense",{"$f":"VLOOKUP(B9,$H$8:$I$27,2,FALSE)","v":"Arena Corinthians"},null,null,"Corinthians","Arena Corinthians"]
["14.05. 16:00","Fluminense","x","Santos","Maracanã",null,null,"Fluminense","Maracanã"]
["14.05. 16:00","Bahia","x","Atlético-PR","Arena Fonte Nova",null,null,"Bahia","Arena Fonte Nova"]
["14.05. 16:00","Avaí","x","Vitória","Ressacada",null,null,"Avaí","Ressacada"]
["14.05. 16:00","Cruzeiro","x","São Paulo","Mineirão",null,null,"Cruzeiro","Mineirão"]
["14.05. 16:00","Ponte Preta","x","Sport Recife","Moisés Lucarelli",null,null,"Ponte Preta","Moisés Lucarelli"]
["14.05. 11:00","Palmeiras","x","Vasco","Allianz Parque",null,null,"Palmeiras","Allianz Parque"]
["13.05. 19:00","Grêmio","x","Botafogo","Arena do Grêmio",null,null,"Grêmio","Arena do Grêmio"]
["13.05. 16:00","Coritiba","x","Atlético-GO","Couto Pereira",null,null,"Coritiba","Couto Pereira"]
[null,null,null,null,{"$error":"#N/A"},null,null,"Santos","Vila Belmiro"]
["rodada 2",null,null,null,{"$error":"#N/A"},null,null,"Chapecoense","Arena Condá"]
["22.05. 20:00","Santos","x","Coritiba","Vila Belmiro",null,null,"Atlético-GO","Serra Dourada"]
["21.05. 19:00","Chapecoense","x","Palmeiras","Arena Condá",null,null,"Vasco","São Januário"]
["21.05. 18:00","Atlético-GO","x","Flamengo","Serra Dourada",null,null,"Vitória","Barradão"]
["21.05. 16:00","Vasco","x","Bahia","São Januário",null,null,"Atlético-PR","Arena da Baixada"]
["21.05. 16:00","Vitória","x","Corinthians","Barradão",null,null,"Botafogo","Nilton Santos"]
["21.05. 16:00","Atlético-PR","x","Grêmio","Arena da Baixada",null,null,"Atlético-MG","Independência"]
["21.05. 11:00","Botafogo","x","Ponte Preta","Nilton Santos",null,null,"Sport Recife","Ilha do Retiro"]
["20.05. 19:00","Atlético-MG","x","Fluminense","Independência",null,null,"São Paulo","Morumbi"]
["20.05. 19:00","Sport Recife","x","Cruzeiro","Ilha do Retiro"]
["20.05. 16:00","São Paulo","x","Avaí","Morumbi"]
[null,null,null,null,{"$error":"#N/A"}]
["rodada 3",null,null,null,{"$error":"#N/A"}]
["29.05. 20:00","São Paulo","x","Palmeiras","Morumbi"]
["28.05. 19:00","Vasco","x","Fluminense","São Januário"]
["28.05. 18:00","Vitória","x","Coritiba","Barradão"]
["28.05. 16:00","Atlético-MG","x","Ponte Preta","Independência"]
["28.05. 16:00","Atlético-PR","x","Flamengo","Arena da Baixada"]
["28.05. 16:00","Atlético-GO","x","Corinthians","Serra Dourada"]
["28.05. 11:00","Santos","x","Cruzeiro","Vila Belmiro"]
["27.05. 21:00","Botafogo","x","Bahia","Nilton Santos"]
["27.05. 19:00","Sport Recife","x","Grêmio","Ilha do Retiro"]
["27.05. 16:00","Chapecoense","x","Avaí","Arena Condá"]
[null,null,null,null,{"$error":"#N/A"}]
["Rodada 4",null,null,null,{"$error":"#N/A"}]
["03.06. 16:00","Coritiba",null,"Atlético-PR","Couto Pereira"]
["03.06. 18:00","Fluminense",null,"Vitória","Maracanã"]
["03.06. 19:00","Corinthians",null,"Santos","Arena Corinthians"]
["04.06. 11:00","Avaí",null,"Sport Recife","Ressacada"]
["04.06. 11:00","Flamengo",null,"Botafogo","Maracanã"]
["04.06. 16:00","Grêmio",null,"Vasco","Arena do Grêmio"]
["04.06. 16:00","Palmeiras",null,"Atlético-MG","Allianz Parque"]
["04.06. 16:00","Ponte Preta",null,"São Paulo","Moisés Lucarelli"]
["04.06. 19:00","Cruzeiro",null,"Chapecoense","Mineirão"]
["05.06. 20:00","Bahia",null,"Atlético-GO","Arena Fonte Nova"]
[null,null,null,null,{"$error":"#N/A"}]
["Rodada 5",null,null,null,{"$error":"#N/A"}]
["06.06. 20:00","Fluminense",null,"Atlético-PR","Maracanã"]
["07.06. 19:30","Atlético-MG",null,"Avaí","Independência"]
["07.06. 19:30","Coritiba",null,"Palmeiras","Couto Pereira"]
["07.06. 21:00","Santos",null,"Botafogo","Vila Belmiro"]
["07.06. 21:45","Chapecoense",null,"Grêmio","Arena Condá"]
["07.06. 21:45","Sport Recife",null,"Flamengo","Ilha do Retiro"]
["07.06. 21:45","Vasco",null,"Corinthians","São Januário"]
["08.06. 19:30","Atlético-GO",null,"Ponte Preta","Serra Dourada"]
["08.06. 19:30","São Paulo",null,"Vitória","Morumbi"]
["08.06. 21:00","Bahia",null,"Cruzeiro","Arena Fonte Nova"]
[null,null,null,null,{"$error":"#N/A"}]
["Rodada 6",null,null,null,{"$error":"#N/A"}]
["10.06. 16:00","Palmeiras",null,"Fluminense","Allianz Parque"]
["10.06. 19:00","Vasco",null,"Sport Recife","São Januário"]
["11.06. 11:00","Botafogo",null,"Coritiba","Nilton Santos"]
["11.06. 16:00","Avaí",null,"Flamengo","Ressacada"]
["11.06. 16:00","Corinthians",null,"São Paulo","Arena Corinthians"]
["11.06. 16:00","Ponte Preta",null,"Chapecoense",{"$f":"VLOOKUP(B73,$H$8:$I$27,2,FALSE)","v":"Moisés Lucarelli"}]
["11.06. 16:00","Vitória",null,"Atlético-MG","Barradão"]
["11.06. 18:30","Cruzeiro",null,"Atlético-GO","Mineirão"]
["11.06. 19:00","Atlético-PR",null,"Santos","Arena da Baixada"]
["12.06. 20:00","Grêmio",null,"Bahia","Arena do Grêmio"]
[null,null,null,null,{"$error":"#N/A"}]
["Rodada 7",null,null,null,{"$error":"#N/A"}]
["14.06. 19:30","Atlético-GO",null,"Avaí","Serra Dourada"]
["14.06. 19:30","Atlético-MG",null,"Atlético-PR","Independência"]
["14.06. 19:30","Sport Recife",null,"São Paulo","Ilha do Retiro"]
["14.06. 19:30","Vitória",null,"Botafogo","Barradão"]
["14.06. 21:00","Flamengo",null,"Ponte Preta","Maracanã"]
["14.06. 21:45","Chapecoense",null,"Vasco","Arena Condá"]
["14.06. 21:45","Corinthians",null,"Cruzeiro","Arena Corinthians"]
["14.06. 21:45","Santos",null,"Palmeiras","Vila Belmiro"]
["15.06. 16:00","Coritiba",null,"Bahia","Couto Pereira"]
["15.06. 21:00","Fluminense",null,"Grêmio","Maracanã"]
[null,null,null,null,{"$error":"#N/A"}]
["Rodada 8",null,null,null,{"$error":"#N/A"}]
["17.06. 16:00","Atlético-GO",null,"Atlético-PR","Serra Dourada"]
["17.06. 19:00","Vasco",null,"Avaí","São Januário"]
["17.06. 21:00","Santos",null,"Ponte Preta","Vila Belmiro"]
["18.06. 11:00","Coritiba",null,"Corinthians","Couto Pereira"]
["18.06. 16:00","Bahia",null,"Palmeiras","Arena Fonte Nova"]
["18.06. 16:00","Chapecoense",null,"Botafogo","Arena Condá"]
["18.06. 16:00","Fluminense",null,"Flamengo","Maracanã"]
["18.06. 16:00","São Paulo",null,"Atlético-MG","Morumbi"]
["18.06. 19:00","Sport Recife",null,"Vitória","Ilha do Retiro"]
["19.06. 20:00","Cruzeiro",null,"Grêmio","Mineirão"]
[null,null,null,null,{"$error":"#N/A"}]
["Rodada 9",null,null,null,{"$error":"#N/A"}]
["21.06. 19:30","Vitória",null,"Santos","Barradão"]
["21.06. 21:00","Botafogo",null,"Vasco","Nilton Santos"]
["21.06. 21:00","Palmeiras",null,"Atlético-GO","Allianz Parque"]
["21.06. 21:45","Atlético-MG",null,"Sport Recife","Independência"]
["21.06. 21:45","Atlético-PR",null,"São Paulo","Arena da Baixada"]
["21.06. 21:45","Avaí",null,"Fluminense","Ressacada"]
["22.06. 19:30","Flamengo",null,"Chapecoense","Maracanã"]
["22.06. 19:30","Ponte Preta",null,"Cruzeiro","Moisés Lucarelli"]
["22.06. 21:00","Corinthians",null,"Bahia","Arena Corinthians"]
["22.06. 21:00","Grêmio",null,"Coritiba","Arena do Grêmio"]
[null,null,null,null,{"$error":"#N/A"}]
["Rodada 10",null,null,null,{"$error":"#N/A"}]
["24.06. 19:00","Santos",null,"Sport Recife","Vila Belmiro"]
["25.06. 11:00","Vasco",null,"Atlético-GO","São Januário"]
["25.06. 16:00","Atlético-PR",null,"Vitória","Arena da Baixada"]
["25.06. 16:00","Cruzeiro",null,"Coritiba","Mineirão"]
["25.06. 16:00","Grêmio",null,"Corinthians","Arena do Grêmio"]
["25.06. 16:00","Ponte Preta",null,"Palmeiras","Moisés Lucarelli"]
["25.06. 16:00","São Paulo",null,"Fluminense","Morumbi"]
["25.06. 18:30","Bahia",null,"Flamengo","Arena Fonte Nova"]
["25.06. 19:00","Chapecoense",null,"Atlético-MG","Arena Condá"]
["26.06. 20:00","Botafogo",null,"Avaí","Nilton Santos"]
[null,null,null,null,{"$error":"#N/A"}]
["Rodada 11",null,null,null,{"$error":"#N/A"}]
["20.06. 17:00","Fluminense",null,"Chapecoense","Maracanã","Antecipada"]
["01.07. 17:00","Atlético-GO",null,"Santos","Serra Dourada"]
["01.07. 17:00","Atlético-MG",null,"Cruzeiro","Independência"]
["01.07. 17:00","Avaí",null,"Ponte Preta","Ressacada"]
["01.07. 17:00","Corinthians",null,"Botafogo","Arena Corinthians"]
["01.07. 17:00","Coritiba",null,"Vasco","Couto Pereira"]
["01.07. 17:00","Flamengo",null,"São Paulo","Maracanã"]
["01.07. 17:00","Palmeiras",null,"Grêmio","Allianz Parque"]
["01.07. 17:00","Sport Recife",null,"Atlético-PR","Ilha do Retiro"]
["01.07. 17:00","Vitória",null,"Bahia",{"$f":"VLOOKUP(B137,$H$8:$I$27,2,FALSE)","v":"Barradão"}]
[null,null,null,null,{"$error":"#N/A"}]
["Rodada 12",null,null,null,{"$error":"#N/A"}]
["08.07. 17:00","Atlético-GO",null,"Vitória","Serra Dourada"]
["08.07. 17:00","Bahia",null,"Fluminense","Arena Fonte Nova"]
["08.07. 17:00","Botafogo",null,"Atlético-MG","Nilton Santos"]
["08.07. 17:00","Chapecoense",null,"Atlético-PR","Arena Condá"]
["08.07. 17:00","Corinthians",null,"Ponte Preta","Arena Corinthians"]
["08.07. 17:00","Coritiba",null,"Sport Recife","Couto Pereira"]
["08.07. 17:00","Cruzeiro",null,"Palmeiras","Mineirão"]
["08.07. 17:00","Grêmio",null,"Avaí","Arena do Grêmio"]
["08.07. 17:00","Santos",null,"São Paulo","Vila Belmiro"]
["08.07. 17:00","Vasco",null,"Flamengo","São Januário"]
[null,null,null,null,{"$error":"#N/A"}]
["Rodada 13",null,null,null,{"$error":"#N/A"}]
["12.07. 17:00","Atlético-MG",null,"Santos","Independência"]
["12.07. 17:00","Atlético-PR",null,"Cruzeiro","Arena da Baixada"]
["12.07. 17:00","Avaí",null,"Coritiba","Ressacada"]
["12.07. 17:00","Flamengo",null,"Grêmio","Maracanã"]
["12.07. 17:00","Fluminense",null,"Botafogo","Maracanã"]
["12.07. 17:00","Palmeiras",null,"Corinthians","Allianz Parque"]
["12.07. 17:00","Ponte Preta",null,"Bahia","Moisés Lucarelli"]
["12.07. 17:00","São Paulo",null,"Atlético-GO","Morumbi"]
["12.07. 17:00","Sport Recife",null,"Chapecoense","Ilha do Retiro"]
["12.07. 17:00","Vitória",null,"Vasco","Barradão"]
[null,null,null,null,{"$error":"#N/A"}]
["Rodada 14",null,null,null,{"$error":"#N/A"}]
["15.07. 17:00","Atlético-GO",null,"Atlético-MG","Serra Dourada"]
["15.07. 17:00","Bahia",null,"Avaí","Arena Fonte Nova"]
["15.07. 17:00","Botafogo",null,"Sport Recife","Nilton Santos"]
["15.07. 17:00","Chapecoense",null,"São Paulo","Arena Condá"]
["15.07. 17:00","Corinthians",null,"Atlético-PR","Arena Corinthians"]
["15.07. 17:00","Coritiba",null,"Fluminense","Couto Pereira"]
["15.07. 17:00","Cruzeiro",null,"Flamengo","Mineirão"]
["15.07. 17:00","Grêmio",null,"Ponte Preta","Arena do Grêmio"]
["15.07. 17:00","Palmeiras",null,"Vitória","Allianz Parque"]
["15.07. 17:00","Vasco",null,"Santos","São Januário"]
[null,null,null,null,{"$error":"#N/A"}]
["Rodada 15",null,null,null,{"$error":"#N/A"}]
["19.07. 17:00","Atlético-MG",null,"Bahia","Independência"]
["19.07. 17:00","Atlético-PR",null,"Botafogo","Arena da Baixada"]
["19.07. 17:00","Avaí",null,"Corinthians","Ressacada"]
["19.07. 17:00","Flamengo",null,"Palmeiras","Maracanã"]
["19.07. 17:00","Fluminense",null,"Cruzeiro","Maracanã"]
["19.07. 17:00","Ponte Preta",null,"Coritiba","Moisés Lucarelli"]
["19.07. 17:00","Santos",null,"Chapecoense","Vila Belmiro"]
["19.07. 17:00","São Paulo",null,"Vasco","Morumbi"]
["19.07. 17:00","Sport Recife",null,"Atlético-GO","Ilha do Retiro"]
["19.07. 17:00","Vitória",null,"Grêmio","Barradão"]
[null,null,null,null,{"$error":"#N/A"}]
["Rodada 16",null,null,null,{"$error":"#N/A"}]
["22.07. 17:00","Atlético-GO",null,"Botafogo","Serra Dourada"]
["22.07. 17:00","Atlético-MG",null,"Vasco","Independência"]
["22.07. 17:00","Atlético-PR",null,"Ponte Preta","Arena da Baixada"]
["22.07. 17:00","Avaí",null,"Cruzeiro","Ressacada"]
["22.07. 17:00","Flamengo",null,"Coritiba","Maracanã"]
["22.07. 17:00","Fluminense",null,"Corinthians","Maracanã"]
["22.07. 17:00","Santos",null,"Bahia","Vila Belmiro"]
["22.07. 17:00","São Paulo",null,"Grêmio","Morumbi"]
["22.07. 17:00","Sport Recife",null,"Palmeiras","Ilha do Retiro"]
["22.07. 17:00","Vitória",null,"Chapecoense","Barradão"]
[null,null,null,null,{"$error":"#N/A"}]
["Rodada 17",null,null,null,{"$error":"#N/A"}]
["29.07. 17:00","Bahia",null,"Sport Recife","Arena Fonte Nova"]
["29.07. 17:00","Botafogo",null,"São Paulo",{"$f":"VLOOKUP(B201,$H$8:$I$27,2,FALSE)","v":"Nilton Santos"}]
["29.07. 17:00","Chapecoense",null,"Atlético-GO","Arena Condá"]
["29.07. 17:00","Corinthians",null,"Flamengo","Arena Corinthians"]
["29.07. 17:00","Coritiba",null,"Atlético-MG","Couto Pereira"]
["29.07. 17:00","Cruzeiro",null,"Vitória","Mineirão"]
["29.07. 17:00","Grêmio",null,"Santos","Arena do Grêmio"]
["29.07. 17:00","Palmeiras",null,"Avaí","Allianz Parque"]
["29.07. 17:00","Ponte Preta",null,"Fluminense","Moisés Lucarelli"]
["29.07. 17:00","Vasco",null,"Atlético-PR","São Januário"]
[null,null,null,null,{"$error":"#N/A"}]
["Rodada 18",null,null,null,{"$error":"#N/A"}]
["02.08. 17:00","Atlético-GO",null,"Grêmio","Serra Dourada"]
["02.08. 17:00","Atlético-MG",null,"Corinthians","Independência"]
["02.08. 17:00","Atlético-PR",null,"Avaí","Arena da Baixada"]
["02.08. 17:00","Botafogo",null,"Palmeiras","Nilton Santos"]
["02.08. 17:00","Chapecoense",null,"Bahia","Arena Condá"]
["02.08. 17:00","Santos",null,"Flamengo","Vila Belmiro"]
["02.08. 17:00","São Paulo",null,"Coritiba","Morumbi"]
["02.08. 17:00","Sport Recife",null,"Fluminense","Ilha do Retiro"]
["02.08. 17:00","Vasco",null,"Cruzeiro","São Januário"]
["02.08. 17:00","Vitória",null,"Ponte Preta","Barradão"]
[null,null,null,null,{"$error":"#N/A"}]
["Rodada 19",null,null,null,{"$error":"#N/A"}]
["05.08. 17:00","Avaí",null,"Santos","Ressacada"]
["05.08. 17:00","Bahia",null,"São Paulo","Arena Fonte Nova"]
["05.08. 17:00","Corinthians",null,"Sport Recife","Arena Corinthians"]
["05.08. 17:00","Coritiba",null,"Chapecoense","Couto Pereira"]
["05.08. 17:00","Cruzeiro",null,"Botafogo","Mineirão"]
["05.08. 17:00","Flamengo",null,"Vitória","Maracanã"]
["05.08. 17:00","Fluminense",null,"Atlético-GO","Maracanã"]
["05.08. 17:00","Grêmio",null,"Atlético-MG","Arena do Grêmio"]
["05.08. 17:00","Palmeiras",null,"Atlético-PR","Allianz Parque"]
["05.08. 17:00","Ponte Preta",null,"Vasco","Moisés Lucarelli"]
[null,null,null,null,{"$error":"#N/A"}]
["Rodada 20",null,null,null,{"$error":"#N/A"}]
["12.08. 17:00","Atlético-GO",null,"Coritiba","Serra Dourada"]
["12.08. 17:00","Atlético-MG",null,"Flamengo","Independência"]
["12.08. 17:00","Atlético-PR",null,"Bahia","Arena da Baixada"]
["12.08. 17:00","Botafogo",null,"Grêmio","Nilton Santos"]
["12.08. 17:00","Chapecoense",null,"Corinthians","Arena Condá"]
["12.08. 17:00","Santos",null,"Fluminense","Vila Belmiro"]
["12.08. 17:00","São Paulo",null,"Cruzeiro","Morumbi"]
["12.08. 17:00","Sport Recife",null,"Ponte Preta","Ilha do Retiro"]
["12.08. 17:00","Vasco",null,"Palmeiras","São Januário"]
["12.08. 17:00","Vitória",null,"Avaí","Barradão"]
[null,null,null,null,{"$error":"#N/A"}]
["Rodada 21",null,null,null,{"$error":"#N/A"}]
["19.08. 17:00","Avaí",null,"São Paulo","Ressacada"]
["19.08. 17:00","Bahia",null,"Vasco","Arena Fonte Nova"]
["19.08. 17:00","Corinthians",null,"Vitória","Arena Corinthians"]
["19.08. 17:00","Coritiba",null,"Santos","Couto Pereira"]
["19.08. 17:00","Cruzeiro",null,"Sport Recife","Mineirão"]
["19.08. 17:00","Flamengo",null,"Atlético-GO","Maracanã"]
["19.08. 17:00","Fluminense",null,"Atlético-MG","Maracanã"]
["19.08. 17:00","Grêmio",null,"Atlético-PR","Arena do Grêmio"]
["19.08. 17:00","Palmeiras",null,"Chapecoense","Allianz Parque"]
["19.08. 17:00","Ponte Preta",null,"Botafogo","Moisés Lucarelli"]
[null,null,null,null,{"$error":"#N/A"}]
["Rodada 22",null,null,null,{"$error":"#N/A"}]
["26.08. 17:00","Avaí",null,"Chapecoense","Ressacada"]
["26.08. 17:00","Bahia",null,"Botafogo","Arena Fonte Nova"]
["26.08. 17:00","Corinthians",null,"Atlético-GO","Arena Corinthians"]
["26.08. 17:00","Coritiba",null,"Vitória","Couto Pereira"]
["26.08. 17:00","Cruzeiro",null,"Santos","Mineirão"]
["26.08. 17:00","Flamengo",null,"Atlético-PR",{"$f":"VLOOKUP(B265,$H$8:$I$27,2,FALSE)","v":"Maracanã"}]
["26.08. 17:00","Fluminense",null,"Vasco","Maracanã"]
["26.08. 17:00","Grêmio",null,"Sport Recife","Arena do Grêmio"]
["26.08. 17:00","Palmeiras",null,"São Paulo","Allianz Parque"]
["26.08. 17:00","Ponte Preta",null,"Atlético-MG","Moisés Lucarelli"]
[null,null,null,null,{"$error":"#N/A"}]
["Rodada 23",null,null,null,{"$error":"#N/A"}]
["09.09. 17:00","Atlético-GO",null,"Bahia","Serra Dourada"]
["09.09. 17:00","Atlético-MG",null,"Palmeiras","Independência"]
["09.09. 17:00","Atlético-PR",null,"Coritiba","Arena da Baixada"]
["09.09. 17:00","Botafogo",null,"Flamengo","Nilton Santos"]
["09.09. 17:00","Chapecoense",null,"Cruzeiro","Arena Condá"]
["09.09. 17:00","Santos",null,"Corinthians","Vila Belmiro"]
["09.09. 17:00","São Paulo",null,"Ponte Preta","Morumbi"]
["09.09. 17:00","Sport Recife",null,"Avaí","Ilha do Retiro"]
["09.09. 17:00","Vasco",null,"Grêmio","São Januário"]
["09.09. 17:00","Vitória",null,"Fluminense","Barradão"]
[null,null,null,null,{"$error":"#N/A"}]
["Rodada 24",null,null,null,{"$error":"#N/A"}]
["16.09. 17:00","Atlético-PR",null,"Fluminense","Arena da Baixada"]
["16.09. 17:00","Avaí",null,"Atlético-MG","Ressacada"]
["16.09. 17:00","Botafogo",null,"Santos","Nilton Santos"]
["16.09. 17:00","Corinthians",null,"Vasco","Arena Corinthians"]
["16.09. 17:00","Cruzeiro",null,"Bahia","Mineirão"]
["16.09. 17:00","Flamengo",null,"Sport Recife","Maracanã"]
["16.09. 17:00","Grêmio",null,"Chapecoense","Arena do Grêmio"]
["16.09. 17:00","Palmeiras",null,"Coritiba","Allianz Parque"]
["16.09. 17:00","Ponte Preta",null,"Atlético-GO","Moisés Lucarelli"]
["16.09. 17:00","Vitória",null,"São Paulo","Barradão"]
[null,null,null,null,{"$error":"#N/A"}]
["Rodada 25",null,null,null,{"$error":"#N/A"}]
["23.09. 17:00","Atlético-GO",null,"Cruzeiro","Serra Dourada"]
["23.09. 17:00","Atlético-MG",null,"Vitória","Independência"]
["23.09. 17:00","Bahia",null,"Grêmio","Arena Fonte Nova"]
["23.09. 17:00","Chapecoense",null,"Ponte Preta","Arena Condá"]
["23.09. 17:00","Coritiba",null,"Botafogo","Couto Pereira"]
["23.09. 17:00","Flamengo",null,"Avaí","Maracanã"]
["23.09. 17:00","Fluminense",null,"Palmeiras","Maracanã"]
["23.09. 17:00","Santos",null,"Atlético-PR","Vila Belmiro"]
["23.09. 17:00","São Paulo",null,"Corinthians","Morumbi"]
["23.09. 17:00","Sport Recife",null,"Vasco","Ilha do Retiro"]
[null,null,null,null,{"$error":"#N/A"}]
["Rodada 26",null,null,null,{"$error":"#N/A"}]
["27.09. 17:00","Atlético-PR",null,"Atlético-MG","Arena da Baixada"]
["27.09. 17:00","Avaí",null,"Atlético-GO","Ressacada"]
["27.09. 17:00","Bahia",null,"Coritiba","Arena Fonte Nova"]
["27.09. 17:00","Botafogo",null,"Vitória","Nilton Santos"]
["27.09. 17:00","Cruzeiro",null,"Corinthians","Mineirão"]
["27.09. 17:00","Grêmio",null,"Fluminense","Arena do Grêmio"]
["27.09. 17:00","Palmeiras",null,"Santos","Allianz Parque"]
["27.09. 17:00","Ponte Preta",null,"Flamengo","Moisés Lucarelli"]
["27.09. 17:00","São Paulo",null,"Sport Recife","Morumbi"]
["27.09. 17:00","Vasco",null,"Chapecoense","São Januário"]
[null,null,null,null,{"$error":"#N/A"}]
["Rodada 27",null,null,null,{"$error":"#N/A"}]
["30.09. 17:00","Atlético-MG",null,"São Paulo","Independência"]
["30.09. 17:00","Atlético-PR",null,"Atlético-GO","Arena da Baixada"]
["30.09. 17:00","Avaí",null,"Vasco","Ressacada"]
["30.09. 17:00","Botafogo",null,"Chapecoense","Nilton Santos"]
["30.09. 17:00","Corinthians",null,"Coritiba","Arena Corinthians"]
["30.09. 17:00","Flamengo",null,"Fluminense","Maracanã"]
["30.09. 17:00","Grêmio",null,"Cruzeiro","Arena do Grêmio"]
["30.09. 17:00","Palmeiras",null,"Bahia","Allianz Parque"]
["30.09. 17:00","Ponte Preta",null,"Santos","Moisés Lucarelli"]
["30.09. 17:00","Vitória",null,"Sport Recife",{"$f":"VLOOKUP(B329,$H$8:$I$27,2,FALSE)","v":"Barradão"}]
[]
["Rodada 28"]
["14.10. 17:00","Atlético-GO",null,"Palmeiras","Serra Dourada"]
["14.10. 17:00","Bahia",null,"Corinthians","Arena Fonte Nova"]
["14.10. 17:00","Chapecoense",null,"Flamengo","Arena Condá"]
["14.10. 17:00","Coritiba",null,"Grêmio","Couto Pereira"]
["14.10. 17:00","Cruzeiro",null,"Ponte Preta","Mineirão"]
["14.10. 17:00","Fluminense",null,"Avaí","Maracanã"]
["14.10. 17:00","Santos",null,"Vitória","Vila Belmiro"]
["14.10. 17:00","São Paulo",null,"Atlético-PR","Morumbi"]
["14.10. 17:00","Sport Recife",null,"Atlético-MG","Ilha do Retiro"]
["14.10. 17:00","Vasco",null,"Botafogo","São Januário"]
[null,null,null,null,{"$error":"#N/A"}]
["Rodada 29",null,null,null,{"$error":"#N/A"}]
["18.10. 18:00","Atlético-GO",null,"Vasco","Serra Dourada"]
["18.10. 18:00","Atlético-MG",null,"Chapecoense","Independência"]
["18.10. 18:00","Avaí",null,"Botafogo","Ressacada"]
["18.10. 18:00","Corinthians",null,"Grêmio","Arena Corinthians"]
["18.10. 18:00","Coritiba",null,"Cruzeiro","Couto Pereira"]
["18.10. 18:00","Flamengo",null,"Bahia","Maracanã"]
["18.10. 18:00","Fluminense",null,"São Paulo","Maracanã"]
["18.10. 18:00","Palmeiras",null,"Ponte Preta","Allianz Parque"]
["18.10. 18:00","Sport Recife",null,"Santos","Ilha do Retiro"]
["18.10. 18:00","Vitória",null,"Atlético-PR","Barradão"]
[null,null,null,null,{"$error":"#N/A"}]
["Rodada 30",null,null,null,{"$error":"#N/A"}]
["21.10. 18:00","Atlético-PR",null,"Sport Recife","Arena da Baixada"]
["21.10. 18:00","Bahia",null,"Vitória","Arena Fonte Nova"]
["21.10. 18:00","Botafogo",null,"Corinthians","Nilton Santos"]
["21.10. 18:00","Chapecoense",null,"Fluminense","Arena Condá"]
["21.10. 18:00","Cruzeiro",null,"Atlético-MG","Mineirão"]
["21.10. 18:00","Grêmio",null,"Palmeiras","Arena do Grêmio"]
["21.10. 18:00","Ponte Preta",null,"Avaí","Moisés Lucarelli"]
["21.10. 18:00","Santos",null,"Atlético-GO","Vila Belmiro"]
["21.10. 18:00","São Paulo",null,"Flamengo","Morumbi"]
["21.10. 18:00","Vasco",null,"Coritiba","São Januário"]
[null,null,null,null,{"$error":"#N/A"}]
["Rodada 31",null,null,null,{"$error":"#N/A"}]
["28.10. 18:00","Atlético-MG",null,"Botafogo","Independência"]
["28.10. 18:00","Atlético-PR",null,"Chapecoense","Arena da Baixada"]
["28.10. 18:00","Avaí",null,"Grêmio","Ressacada"]
["28.10. 18:00","Flamengo",null,"Vasco","Maracanã"]
["28.10. 18:00","Fluminense",null,"Bahia","Maracanã"]
["28.10. 18:00","Palmeiras",null,"Cruzeiro","Allianz Parque"]
["28.10. 18:00","Ponte Preta",null,"Corinthians","Moisés Lucarelli"]
["28.10. 18:00","São Paulo",null,"Santos","Morumbi"]
["28.10. 18:00","Sport Recife",null,"Coritiba","Ilha do Retiro"]
["28.10. 18:00","Vitória",null,"Atlético-GO","Barradão"]
[null,null,null,null,{"$error":"#N/A"}]
["Rodada 32",null,null,null,{"$error":"#N/A"}]
["04.11. 19:00","Atlético-GO",null,"São Paulo","Serra Dourada"]
["04.11. 19:00","Bahia",null,"Ponte Preta","Arena Fonte Nova"]
["04.11. 19:00","Botafogo",null,"Fluminense","Nilton Santos"]
["04.11. 19:00","Chapecoense",null,"Sport Recife","Arena Condá"]
["04.11. 19:00","Corinthians",null,"Palmeiras","Arena Corinthians"]
["04.11. 19:00","Coritiba",null,"Avaí","Couto Pereira"]
["04.11. 19:00","Cruzeiro",null,"Atlético-PR","Mineirão"]
["04.11. 19:00","Grêmio",null,"Flamengo","Arena do Grêmio"]
["04.11. 19:00","Santos",null,"Atlético-MG","Vila Belmiro"]
["04.11. 19:00","Vasco",null,"Vitória","São Januário"]
[null,null,null,null,{"$error":"#N/A"}]
["Rodada 33",null,null,null,{"$error":"#N/A"}]
["08.11. 19:00","Atlético-MG",null,"Atlético-GO","Independência"]
["08.11. 19:00","Atlético-PR",null,"Corinthians","Arena da Baixada"]
["08.11. 19:00","Avaí",null,"Bahia","Ressacada"]
["08.11. 19:00","Flamengo",null,"Cruzeiro",{"$f":"VLOOKUP(B395,$H$8:$I$27,2,FALSE)","v":"Maracanã"}]
["08.11. 19:00","Fluminense",null,"Coritiba","Maracanã"]
["08.11. 19:00","Ponte Preta",null,"Grêmio","Moisés Lucarelli"]
["08.11. 19:00","Santos",null,"Vasco","Vila Belmiro"]
["08.11. 19:00","São Paulo",null,"Chapecoense","Morumbi"]
["08.11. 19:00","Sport Recife",null,"Botafogo","Ilha do Retiro"]
["08.11. 19:00","Vitória",null,"Palmeiras","Barradão"]
[null,null,null,null,{"$error":"#N/A"}]
["Rodada 34",null,null,null,{"$error":"#N/A"}]
["11.11. 19:00","Atlético-GO",null,"Sport Recife","Serra Dourada"]
["11.11. 19:00","Bahia",null,"Atlético-MG","Arena Fonte Nova"]
["11.11. 19:00","Botafogo",null,"Atlético-PR","Nilton Santos"]
["11.11. 19:00","Chapecoense",null,"Santos","Arena Condá"]
["11.11. 19:00","Corinthians",null,"Avaí","Arena Corinthians"]
["11.11. 19:00","Coritiba",null,"Ponte Preta","Couto Pereira"]
["11.11. 19:00","Cruzeiro",null,"Fluminense","Mineirão"]
["11.11. 19:00","Grêmio",null,"Vitória","Arena do Grêmio"]
["11.11. 19:00","Palmeiras",null,"Flamengo","Allianz Parque"]
["11.11. 19:00","Vasco",null,"São Paulo","São Januário"]
[null,null,null,null,{"$error":"#N/A"}]
["Rodada 35",null,null,null,{"$error":"#N/A"}]
["15.11. 19:00","Bahia",null,"Santos","Arena Fonte Nova"]
["15.11. 19:00","Botafogo",null,"Atlético-GO","Nilton Santos"]
["15.11. 19:00","Chapecoense",null,"Vitória","Arena Condá"]
["15.11. 19:00","Corinthians",null,"Fluminense","Arena Corinthians"]
["15.11. 19:00","Coritiba",null,"Flamengo","Couto Pereira"]
["15.11. 19:00","Cruzeiro",null,"Avaí","Mineirão"]
["15.11. 19:00","Grêmio",null,"São Paulo","Arena do Grêmio"]
["15.11. 19:00","Palmeiras",null,"Sport Recife","Allianz Parque"]
["15.11. 19:00","Ponte Preta",null,"Atlético-PR","Moisés Lucarelli"]
["15.11. 19:00","Vasco",null,"Atlético-MG","São Januário"]
[null,null,null,null,{"$error":"#N/A"}]
["Rodada 36",null,null,null,{"$error":"#N/A"}]
["18.11. 19:00","Atlético-GO",null,"Chapecoense","Serra Dourada"]
["18.11. 19:00","Atlético-MG",null,"Coritiba","Independência"]
["18.11. 19:00","Atlético-PR",null,"Vasco","Arena da Baixada"]
["18.11. 19:00","Avaí",null,"Palmeiras","Ressacada"]
["18.11. 19:00","Flamengo",null,"Corinthians","Maracanã"]
["18.11. 19:00","Fluminense",null,"Ponte Preta","Maracanã"]
["18.11. 19:00","Santos",null,"Grêmio","Vila Belmiro"]
["18.11. 19:00","São Paulo",null,"Botafogo","Morumbi"]
["18.11. 19:00","Sport Recife",null,"Bahia","Ilha do Retiro"]
["18.11. 19:00","Vitória",null,"Cruzeiro","Barradão"]
[null,null,null,null,{"$error":"#N/A"}]
["Rodada 37",null,null,null,{"$error":"#N/A"}]
["25.11. 19:00","Avaí",null,"Atlético-PR","Ressacada"]
["25.11. 19:00","Bahia",null,"Chapecoense","Arena Fonte Nova"]
["25.11. 19:00","Corinthians",null,"Atlético-MG","Arena Corinthians"]
["25.11. 19:00","Coritiba",null,"São Paulo","Couto Pereira"]
["25.11. 19:00","Cruzeiro",null,"Vasco","Mineirão"]
["25.11. 19:00","Flamengo",null,"Santos","Maracanã"]
["25.11. 19:00","Fluminense",null,"Sport Recife","Maracanã"]
["25.11. 19:00","Grêmio",null,"Atlético-GO","Arena do Grêmio"]
["25.11. 19:00","Palmeiras",null,"Botafogo","Allianz Parque"]
["25.11. 19:00","Ponte Preta",null,"Vitória","Moisés Lucarelli"]
[null,null,null,null,{"$error":"#N/A"}]
["Rodada 38",null,null,null,{"$error":"#N/A"}]
["03.12. 19:00","Atlético-GO",null,"Fluminense","Serra Dourada"]
["03.12. 19:00","Atlético-MG",null,"Grêmio","Independência"]
["03.12. 19:00","Atlético-PR",null,"Palmeiras","Arena da Baixada"]
["03.12. 19:00","Botafogo",null,"Cruzeiro","Nilton Santos"]
["03.12. 19:00","Chapecoense",null,"Coritiba","Arena Condá"]
["03.12. 19:00","Santos",null,"Avaí","Vila Belmiro"]
["03.12. 19:00","São Paulo",null,"Bahia","Morumbi"]
["03.12. 19:00","Sport Recife",null,"Corinthians",{"$f":"VLOOKUP(B459,$H$8:$I$27,2,FALSE)","v":"Ilha do Retiro"}]
["03.12. 19:00","Vasco",null,"Ponte Preta","São Januário"]
["03.12. 19:00","Vitória",null,"Flamengo",{"$f":"VLOOKUP(B461,$H$8:$I$27,2,FALSE)","v":"Barradão"}]

{"sheet":"classificação","index":2,"n_rows":25,"n_cols":17,"rows_kept":25,"cut":false,"hidden":false,"merged":[[2,16,2,18],[4,16,4,18]]}
[null,null,"Classificação","Ponto","Jogo","Vitoria","Empate","derrota","Gol Marcado","Gol contra","Saldo",null,"Pontos Perdidos","Aproveitamento"]
[null,{"$f":"TABELA!I6","v":1},{"$f":"TABELA!J6","v":"Chapecoense"},{"$f":"TABELA!K6","v":7},{"$f":"TABELA!L6","v":3},{"$f":"TABELA!M6","v":2},{"$f":"TABELA!N6","v":1},{"$f":"TABELA!O6","v":0},{"$f":"TABELA!P6","v":4},{"$f":"TABELA!Q6","v":1},{"$f":"TABELA!R6","v":3},null,{"$f":"TABELA!T6","v":2},{"$f":"TABELA!U6","v":0.77777777777777779}]
[null,{"$f":"TABELA!I7","v":2},{"$f":"TABELA!J7","v":"Cruzeiro"},{"$f":"TABELA!K7","v":7},{"$f":"TABELA!L7","v":3},{"$f":"TABELA!M7","v":2},{"$f":"TABELA!N7","v":1},{"$f":"TABELA!O7","v":0},{"$f":"TABELA!P7","v":3},{"$f":"TABELA!Q7","v":1},{"$f":"TABELA!R7","v":2},null,{"$f":"TABELA!T7","v":2},{"$f":"TABELA!U7","v":0.77777777777777779},null,null,"Veja mais planilhas em:"]
[null,{"$f":"TABELA!I8","v":3},{"$f":"TABELA!J8","v":"Corinthians"},{"$f":"TABELA!K8","v":7},{"$f":"TABELA!L8","v":3},{"$f":"TABELA!M8","v":2},{"$f":"TABELA!N8","v":1},{"$f":"TABELA!O8","v":0},{"$f":"TABELA!P8","v":3},{"$f":"TABELA!Q8","v":1},{"$f":"TABELA!R8","v":2},null,{"$f":"TABELA!T8","v":2},{"$f":"TABELA!U8","v":0.77777777777777779}]
[null,{"$f":"TABELA!I9","v":4},{"$f":"TABELA!J9","v":"Grêmio"},{"$f":"TABELA!K9","v":6},{"$f":"TABELA!L9","v":3},{"$f":"TABELA!M9","v":2},{"$f":"TABELA!N9","v":0},{"$f":"TABELA!O9","v":1},{"$f":"TABELA!P9","v":7},{"$f":"TABELA!Q9","v":4},{"$f":"TABELA!R9","v":3},null,{"$f":"TABELA!T9","v":3},{"$f":"TABELA!U9","v":0.66666666666666663},null,null,"www.tudoexcel.com.br"]
[null,{"$f":"TABELA!I10","v":5},{"$f":"TABELA!J10","v":"Coritiba"},{"$f":"TABELA!K10","v":6},{"$f":"TABELA!L10","v":3},{"$f":"TABELA!M10","v":2},{"$f":"TABELA!N10","v":0},{"$f":"TABELA!O10","v":1},{"$f":"TABELA!P10","v":5},{"$f":"TABELA!Q10","v":2},{"$f":"TABELA!R10","v":3},null,{"$f":"TABELA!T10","v":3},{"$f":"TABELA!U10","v":0.66666666666666663}]
[null,{"$f":"TABELA!I11","v":6},{"$f":"TABELA!J11","v":"São Paulo"},{"$f":"TABELA!K11","v":6},{"$f":"TABELA!L11","v":3},{"$f":"TABELA!M11","v":2},{"$f":"TABELA!N11","v":0},{"$f":"TABELA!O11","v":1},{"$f":"TABELA!P11","v":4},{"$f":"TABELA!Q11","v":1},{"$f":"TABELA!R11","v":3},null,{"$f":"TABELA!T11","v":3},{"$f":"TABELA!U11","v":0.66666666666666663}]
[null,{"$f":"TABELA!I12","v":7},{"$f":"TABELA!J12","v":"Fluminense"},{"$f":"TABELA!K12","v":6},{"$f":"TABELA!L12","v":3},{"$f":"TABELA!M12","v":2},{"$f":"TABELA!N12","v":0},{"$f":"TABELA!O12","v":1},{"$f":"TABELA!P12","v":7},{"$f":"TABELA!Q12","v":6},{"$f":"TABELA!R12","v":1},null,{"$f":"TABELA!T12","v":3},{"$f":"TABELA!U12","v":0.66666666666666663}]
[null,{"$f":"TABELA!I13","v":8},{"$f":"TABELA!J13","v":"Botafogo"},{"$f":"TABELA!K13","v":6},{"$f":"TABELA!L13","v":3},{"$f":"TABELA!M13","v":2},{"$f":"TABELA!N13","v":0},{"$f":"TABELA!O13","v":1},{"$f":"TABELA!P13","v":3},{"$f":"TABELA!Q13","v":2},{"$f":"TABELA!R13","v":1},null,{"$f":"TABELA!T13","v":3},{"$f":"TABELA!U13","v":0.66666666666666663}]
[null,{"$f":"TABELA!I14","v":9},{"$f":"TABELA!J14","v":"Vasco"},{"$f":"TABELA!K14","v":6},{"$f":"TABELA!L14","v":3},{"$f":"TABELA!M14","v":2},{"$f":"TABELA!N14","v":0},{"$f":"TABELA!O14","v":1},{"$f":"TABELA!P14","v":5},{"$f":"TABELA!Q14","v":7},{"$f":"TABELA!R14","v":-2},null,{"$f":"TABELA!T14","v":3},{"$f":"TABELA!U14","v":0.66666666666666663}]
[null,{"$f":"TABELA!I15","v":10},{"$f":"TABELA!J15","v":"Flamengo"},{"$f":"TABELA!K15","v":5},{"$f":"TABELA!L15","v":3},{"$f":"TABELA!M15","v":1},{"$f":"TABELA!N15","v":2},{"$f":"TABELA!O15","v":0},{"$f":"TABELA!P15","v":5},{"$f":"TABELA!Q15","v":2},{"$f":"TABELA!R15","v":3},null,{"$f":"TABELA!T15","v":4},{"$f":"TABELA!U15","v":0.55555555555555558}]
[null,{"$f":"TABELA!I16","v":11},{"$f":"TABELA!J16","v":"Ponte Preta"},{"$f":"TABELA!K16","v":4},{"$f":"TABELA!L16","v":3},{"$f":"TABELA!M16","v":1},{"$f":"TABELA!N16","v":1},{"$f":"TABELA!O16","v":1},{"$f":"TABELA!P16","v":6},{"$f":"TABELA!Q16","v":4},{"$f":"TABELA!R16","v":2},null,{"$f":"TABELA!T16","v":5},{"$f":"TABELA!U16","v":0.44444444444444442}]
[null,{"$f":"TABELA!I17","v":12},{"$f":"TABELA!J17","v":"Sport Recife"},{"$f":"TABELA!K17","v":4},{"$f":"TABELA!L17","v":3},{"$f":"TABELA!M17","v":1},{"$f":"TABELA!N17","v":1},{"$f":"TABELA!O17","v":1},{"$f":"TABELA!P17","v":5},{"$f":"TABELA!Q17","v":8},{"$f":"TABELA!R17","v":-3},null,{"$f":"TABELA!T17","v":5},{"$f":"TABELA!U17","v":0.44444444444444442}]
[null,{"$f":"TABELA!I18","v":13},{"$f":"TABELA!J18","v":"Bahia"},{"$f":"TABELA!K18","v":3},{"$f":"TABELA!L18","v":3},{"$f":"TABELA!M18","v":1},{"$f":"TABELA!N18","v":0},{"$f":"TABELA!O18","v":2},{"$f":"TABELA!P18","v":7},{"$f":"TABELA!Q18","v":5},{"$f":"TABELA!R18","v":2},null,{"$f":"TABELA!T18","v":6},{"$f":"TABELA!U18","v":0.33333333333333331}]
[null,{"$f":"TABELA!I19","v":14},{"$f":"TABELA!J19","v":"Palmeiras"},{"$f":"TABELA!K19","v":3},{"$f":"TABELA!L19","v":3},{"$f":"TABELA!M19","v":1},{"$f":"TABELA!N19","v":0},{"$f":"TABELA!O19","v":2},{"$f":"TABELA!P19","v":4},{"$f":"TABELA!Q19","v":3},{"$f":"TABELA!R19","v":1},null,{"$f":"TABELA!T19","v":6},{"$f":"TABELA!U19","v":0.33333333333333331}]
[null,{"$f":"TABELA!I20","v":15},{"$f":"TABELA!J20","v":"Santos"},{"$f":"TABELA!K20","v":3},{"$f":"TABELA!L20","v":3},{"$f":"TABELA!M20","v":1},{"$f":"TABELA!N20","v":0},{"$f":"TABELA!O20","v":2},{"$f":"TABELA!P20","v":3},{"$f":"TABELA!Q20","v":4},{"$f":"TABELA!R20","v":-1},null,{"$f":"TABELA!T20","v":6},{"$f":"TABELA!U20","v":0.33333333333333331}]
[null,{"$f":"TABELA!I21","v":16},{"$f":"TABELA!J21","v":"Atlético-MG"},{"$f":"TABELA!K21","v":2},{"$f":"TABELA!L21","v":3},{"$f":"TABELA!M21","v":0},{"$f":"TABELA!N21","v":2},{"$f":"TABELA!O21","v":1},{"$f":"TABELA!P21","v":4},{"$f":"TABELA!Q21","v":5},{"$f":"TABELA!R21","v":-1},null,{"$f":"TABELA!T21","v":7},{"$f":"TABELA!U21","v":0.22222222222222221}]
[null,{"$f":"TABELA!I22","v":17},{"$f":"TABELA!J22","v":"Vitória"},{"$f":"TABELA!K22","v":1},{"$f":"TABELA!L22","v":3},{"$f":"TABELA!M22","v":0},{"$f":"TABELA!N22","v":1},{"$f":"TABELA!O22","v":2},{"$f":"TABELA!P22","v":0},{"$f":"TABELA!Q22","v":2},{"$f":"TABELA!R22","v":-2},null,{"$f":"TABELA!T22","v":8},{"$f":"TABELA!U22","v":0.1111111111111111}]
[null,{"$f":"TABELA!I23","v":18},{"$f":"TABELA!J23","v":"Avaí"},{"$f":"TABELA!K23","v":1},{"$f":"TABELA!L23","v":3},{"$f":"TABELA!M23","v":0},{"$f":"TABELA!N23","v":1},{"$f":"TABELA!O23","v":2},{"$f":"TABELA!P23","v":0},{"$f":"TABELA!Q23","v":4},{"$f":"TABELA!R23","v":-4},null,{"$f":"TABELA!T23","v":8},{"$f":"TABELA!U23","v":0.1111111111111111}]
[null,{"$f":"TABELA!I24","v":19},{"$f":"TABELA!J24","v":"Atlético-PR"},{"$f":"TABELA!K24","v":1},{"$f":"TABELA!L24","v":3},{"$f":"TABELA!M24","v":0},{"$f":"TABELA!N24","v":1},{"$f":"TABELA!O24","v":2},{"$f":"TABELA!P24","v":3},{"$f":"TABELA!Q24","v":9},{"$f":"TABELA!R24","v":-6},null,{"$f":"TABELA!T24","v":8},{"$f":"TABELA!U24","v":0.1111111111111111}]
[null,{"$f":"TABELA!I25","v":20},{"$f":"TABELA!J25","v":"Atlético-GO"},{"$f":"TABELA!K25","v":0},{"$f":"TABELA!L25","v":3},{"$f":"TABELA!M25","v":0},{"$f":"TABELA!N25","v":0},{"$f":"TABELA!O25","v":3},{"$f":"TABELA!P25","v":1},{"$f":"TABELA!Q25","v":8},{"$f":"TABELA!R25","v":-7},null,{"$f":"TABELA!T25","v":9},{"$f":"TABELA!U25","v":0}]
[null,{"$f":"TABELA!I26","v":0}]
[null,{"$f":"TABELA!I27","v":0}]
[null,{"$f":"TABELA!I28","v":0}]
[null,{"$f":"TABELA!I29","v":0}]

{"sheet":"MAIS PLANILHAS DE EXCEL","index":3,"n_rows":25,"n_cols":4,"rows_kept":25,"cut":false,"hidden":false,"merged":[[6,1,8,1],[6,3,8,3],[0,1,1,1],[0,2,1,2],[0,3,1,3],[2,1,4,1],[2,3,4,3],[22,1,22,3],[10,3,12,3],[10,1,12,1],[14,1,16,1],[14,3,16,3],[18,1,20,1],[18,3,20,3]]}
[null,"Veja Outras Planilhas de Excel no guia de compra",null,"www.guiadecompra.com"]
[]
[null,"Planilha de Gastos Doméstico",null,"Planilha de cadastro de Clientes"]
[]
[]
[]
[null,"Planilha de Fluxo de Caixa",null,"Planilhas de Orçamento Familiar"]
[]
[]
[]
[null,"Planilha Para Controle de Estoque",null,"Planilha Custo de Fabricação de Produtos"]
[]
[]
[]
[null,"Planilha Para Cotação de Preços",null,"Planilha de Custo de Construção e Reformas"]
[]
[]
[]
[null,"Baixar Mais Planilhas de Excel",null,"Tabela da Copa do Mundo"]
[]
[]
[]
[null,"Baixe outras planilha de Excel. Otimize seu dia-a-dia fazendo o controle de suas operações"]
[null,"www.tudoexcel.com.br"]
[null,{"$f":"B24","v":"www.tudoexcel.com.br"}]